Ticket #6539: debugbuild_failure

File debugbuild_failure, 8.3 KB (added by gk, 8 years ago)
Line 
1c++ -o nsLayoutStatics.o -c -I../../dist/stl_wrappers -I../../dist/system_wrappers -include /home/firefox/FFBuild/ImgPatchTest/mozilla-release/config/gcc_hidden.h -DMOZ_GLUE_IN_PROGRAM -DXPCOM_TRANSLATE_NSGM_ENTRY_POINT=1 -DMOZILLA_INTERNAL_API -D_IMPL_NS_COM -DEXPORT_XPT_API -DEXPORT_XPTC_API -D_IMPL_NS_GFX -D_IMPL_NS_WIDGET -DIMPL_XREAPI -DIMPL_NS_NET -DIMPL_THEBES  -DSTATIC_EXPORTABLE_JS_API -DOSTYPE=\"Linux3.2\" -DOSARCH=Linux -DEXCLUDE_SKIA_DEPENDENCIES  -DOS_LINUX=1 -DOS_POSIX=1  -D_IMPL_NS_LAYOUT -I/home/firefox/FFBuild/ImgPatchTest/mozilla-release/dom/system/unix  -I/home/firefox/FFBuild/ImgPatchTest/mozilla-release/layout/build/../inspector/src  -I/home/firefox/FFBuild/ImgPatchTest/mozilla-release/ipc/chromium/src -I/home/firefox/FFBuild/ImgPatchTest/mozilla-release/ipc/glue -I../../ipc/ipdl/_ipdlheaders  -I/home/firefox/FFBuild/ImgPatchTest/mozilla-release/layout/build/../base -I/home/firefox/FFBuild/ImgPatchTest/mozilla-release/layout/build/../generic -I/home/firefox/FFBuild/ImgPatchTest/mozilla-release/layout/build/../forms -I/home/firefox/FFBuild/ImgPatchTest/mozilla-release/layout/build/../tables -I/home/firefox/FFBuild/ImgPatchTest/mozilla-release/layout/build/../style -I/home/firefox/FFBuild/ImgPatchTest/mozilla-release/layout/build/../xul/base/src -I/home/firefox/FFBuild/ImgPatchTest/mozilla-release/layout/build/../mathml -I/home/firefox/FFBuild/ImgPatchTest/mozilla-release/content/base/src -I/home/firefox/FFBuild/ImgPatchTest/mozilla-release/content/canvas/src -I/home/firefox/FFBuild/ImgPatchTest/mozilla-release/content/html/content/src -I/home/firefox/FFBuild/ImgPatchTest/mozilla-release/content/html/document/src -I/home/firefox/FFBuild/ImgPatchTest/mozilla-release/content/xslt/src/base -I/home/firefox/FFBuild/ImgPatchTest/mozilla-release/content/xslt/src/xml -I/home/firefox/FFBuild/ImgPatchTest/mozilla-release/content/xslt/src/xpath -I/home/firefox/FFBuild/ImgPatchTest/mozilla-release/content/xslt/src/xslt -I/home/firefox/FFBuild/ImgPatchTest/mozilla-release/content/xul/content/src -I/home/firefox/FFBuild/ImgPatchTest/mozilla-release/content/xul/document/src -I/home/firefox/FFBuild/ImgPatchTest/mozilla-release/content/xul/templates/src -I/home/firefox/FFBuild/ImgPatchTest/mozilla-release/content/events/src -I/home/firefox/FFBuild/ImgPatchTest/mozilla-release/content/xbl/src -I/home/firefox/FFBuild/ImgPatchTest/mozilla-release/view/src -I/home/firefox/FFBuild/ImgPatchTest/mozilla-release/dom/base -I/home/firefox/FFBuild/ImgPatchTest/mozilla-release/dom/src/json -I/home/firefox/FFBuild/ImgPatchTest/mozilla-release/dom/src/jsurl -I/home/firefox/FFBuild/ImgPatchTest/mozilla-release/dom/src/storage -I/home/firefox/FFBuild/ImgPatchTest/mozilla-release/dom/src/offline -I/home/firefox/FFBuild/ImgPatchTest/mozilla-release/dom/src/geolocation -I/home/firefox/FFBuild/ImgPatchTest/mozilla-release/dom/contacts -I/home/firefox/FFBuild/ImgPatchTest/mozilla-release/dom/settings -I/home/firefox/FFBuild/ImgPatchTest/mozilla-release/dom/telephony -I. -I/home/firefox/FFBuild/ImgPatchTest/mozilla-release/editor/libeditor/base -I/home/firefox/FFBuild/ImgPatchTest/mozilla-release/editor/libeditor/text -I/home/firefox/FFBuild/ImgPatchTest/mozilla-release/editor/libeditor/html -I/home/firefox/FFBuild/ImgPatchTest/mozilla-release/editor/txtsvc/src -I/home/firefox/FFBuild/ImgPatchTest/mozilla-release/editor/composer/src -I/home/firefox/FFBuild/ImgPatchTest/mozilla-release/js/xpconnect/src -I/home/firefox/FFBuild/ImgPatchTest/mozilla-release/js/xpconnect/loader -I/home/firefox/FFBuild/ImgPatchTest/mozilla-release/caps/include -I/home/firefox/FFBuild/ImgPatchTest/mozilla-release/netwerk/base/src -I/home/firefox/FFBuild/ImgPatchTest/mozilla-release/content/svg/content/src  -I/home/firefox/FFBuild/ImgPatchTest/mozilla-release/layout/build -I. -I../../dist/include -I../../dist/include/nsprpub  -I/home/firefox/FFBuild/ImgPatchTest/mozilla-release/obj-i686-pc-linux-gnu/dist/include/nspr -I/home/firefox/FFBuild/ImgPatchTest/mozilla-release/obj-i686-pc-linux-gnu/dist/include/nss      -fPIC -fno-rtti -Wall -Wpointer-arith -Woverloaded-virtual -Werror=return-type -Wtype-limits -Wempty-body -Wno-ctor-dtor-privacy -Wno-overlength-strings -Wno-invalid-offsetof -Wno-variadic-macros -Wcast-align -Wno-long-long -fno-exceptions -fno-strict-aliasing -std=gnu++0x -ffunction-sections -fdata-sections -pthread -pipe -DDEBUG -D_DEBUG -DTRACING -g -Os -freorder-blocks  -fno-omit-frame-pointer    -DMOZILLA_CLIENT -include ../../mozilla-config.h -MD -MF .deps/nsLayoutStatics.pp /home/firefox/FFBuild/ImgPatchTest/mozilla-release/layout/build/nsLayoutStatics.cpp
2In file included from /home/firefox/FFBuild/ImgPatchTest/mozilla-release/content/xul/content/src/nsXULElement.h:61:0,
3                 from /home/firefox/FFBuild/ImgPatchTest/mozilla-release/layout/build/nsLayoutStatics.cpp:97:
4../../dist/include/nsIDOMXULSelectCntrlEl.h:33:28: Warnung: »virtual nsresult nsIDOMXULSelectControlElement::GetSelectedItem(nsIDOMXULSelectControlItemElement**)« war versteckt [-Woverloaded-virtual]
5../../dist/include/nsIDOMXULMultSelectCntrlEl.h:73:28: Warnung:   von »virtual nsresult nsIDOMXULMultiSelectControlElement::GetSelectedItem(PRInt32, nsIDOMXULSelectControlItemElement**)« [-Woverloaded-virtual]
6In file included from /home/firefox/FFBuild/ImgPatchTest/mozilla-release/layout/build/nsLayoutModule.cpp:112:0:
7/home/firefox/FFBuild/ImgPatchTest/mozilla-release/content/base/src/FileIOObject.h:79:3: Warnung: »virtual nsresult mozilla::dom::FileIOObject::Notify(nsITimer*)« war versteckt [-Woverloaded-virtual]
8/home/firefox/FFBuild/ImgPatchTest/mozilla-release/content/base/src/nsDOMFileReader.h:94:14: Warnung:   von »virtual nsresult nsDOMFileReader::Notify(const char*, nsDetectionConfident)« [-Woverloaded-virtual]
9In file included from /home/firefox/FFBuild/ImgPatchTest/mozilla-release/layout/build/nsLayoutModule.cpp:117:0:
10/home/firefox/FFBuild/ImgPatchTest/mozilla-release/netwerk/base/src/nsSimpleURI.h:69:5: Warnung: »virtual bool nsSimpleURI::Read(const IPC::Message*, void**)« war versteckt [-Woverloaded-virtual]
11/home/firefox/FFBuild/ImgPatchTest/mozilla-release/dom/src/jsurl/nsJSProtocolHandler.h:115:16: Warnung:   von »virtual nsresult nsJSURI::Read(nsIObjectInputStream*)« [-Woverloaded-virtual]
12/home/firefox/FFBuild/ImgPatchTest/mozilla-release/netwerk/base/src/nsSimpleURI.h:69:5: Warnung: »virtual void nsSimpleURI::Write(IPC::Message*)« war versteckt [-Woverloaded-virtual]
13/home/firefox/FFBuild/ImgPatchTest/mozilla-release/dom/src/jsurl/nsJSProtocolHandler.h:116:16: Warnung:   von »virtual nsresult nsJSURI::Write(nsIObjectOutputStream*)« [-Woverloaded-virtual]
14In file included from ../../dist/include/nsAutoPtr.h:48:0,
15                 from /home/firefox/FFBuild/ImgPatchTest/mozilla-release/js/xpconnect/src/xpcprivate.h:69,
16                 from /home/firefox/FFBuild/ImgPatchTest/mozilla-release/js/xpconnect/src/XPCModule.h:41,
17                 from /home/firefox/FFBuild/ImgPatchTest/mozilla-release/layout/build/nsLayoutModule.cpp:41:
18../../dist/include/nsCOMPtr.h: In Destruktor »nsCOMPtr<T>::~nsCOMPtr() [with T = nsICookiePermission]«:
19/home/firefox/FFBuild/ImgPatchTest/mozilla-release/content/base/src/ThirdPartyUtil.h:51:7:   instanziiert von hier
20../../dist/include/nsCOMPtr.h:519:11: Fehler: ungültiges static_cast vom Typ »nsICookiePermission*« in den Typ »nsISupports*«
21../../dist/include/nsCOMPtr.h:521:13: Fehler: falsche Benutzung des unvollständigen Typs »struct nsICookiePermission«
22/home/firefox/FFBuild/ImgPatchTest/mozilla-release/content/base/src/ThirdPartyUtil.h:49:7: Fehler: Vorwärtsdeklaration von »struct nsICookiePermission«
23make[6]: *** [nsLayoutModule.o] Fehler 1
24make[6]: Verlasse Verzeichnis '/home/firefox/FFBuild/ImgPatchTest/mozilla-release/obj-i686-pc-linux-gnu/layout/build'
25make[5]: *** [libs] Fehler 2
26make[5]: Verlasse Verzeichnis '/home/firefox/FFBuild/ImgPatchTest/mozilla-release/obj-i686-pc-linux-gnu/layout'
27make[4]: *** [libs_tier_platform] Fehler 2
28make[4]: Verlasse Verzeichnis '/home/firefox/FFBuild/ImgPatchTest/mozilla-release/obj-i686-pc-linux-gnu'
29make[3]: *** [tier_platform] Fehler 2
30make[3]: Verlasse Verzeichnis '/home/firefox/FFBuild/ImgPatchTest/mozilla-release/obj-i686-pc-linux-gnu'
31make[2]: *** [default] Fehler 2
32make[2]: Verlasse Verzeichnis '/home/firefox/FFBuild/ImgPatchTest/mozilla-release/obj-i686-pc-linux-gnu'
33make[1]: *** [realbuild] Fehler 2
34make[1]: Verlasse Verzeichnis '/home/firefox/FFBuild/ImgPatchTest/mozilla-release'
35make: *** [build] Fehler 2