Ticket #9711: cross_mac_build1

File cross_mac_build1, 49.8 KB (added by gk, 6 years ago)
Line 
1[INFO ]  Performing some trivial sanity checks
2[DEBUG]  Testing '! ( -n  )'
3[DEBUG]  Testing '! ( -n  )'
4[DEBUG]  Testing '! ( -n  )'
5[DEBUG]  Testing '! ( -n  )'
6[DEBUG]  Testing '! ( -n  )'
7[DEBUG]  Testing '! ( -n  )'
8[DEBUG]  ==> Executing: 'mkdir' '-p' '/home/ubuntu/build/crosstool-ng/ct-ng-final/.build'
9[DEBUG]  ==> Executing: 'rm' '-f' '/home/ubuntu/build/crosstool-ng/ct-ng-final/.build/backtrace'
10[DEBUG]  ==> Executing: 'touch' '/home/ubuntu/build/crosstool-ng/ct-ng-final/.build/foo'
11[DEBUG]  Testing '! ( -f /home/ubuntu/build/crosstool-ng/ct-ng-final/.build/FOO )'
12[DEBUG]  ==> Executing: 'rm' '-f' '/home/ubuntu/build/crosstool-ng/ct-ng-final/.build/foo'
13[DEBUG]  Testing '-f /bin/bash -a -x /bin/bash'
14[DEBUG]  Creating bin-override for tools in '/home/ubuntu/build/crosstool-ng/ct-ng-final/.build/tools'
15[DEBUG]  ==> Executing: 'mkdir' '-p' '/home/ubuntu/build/crosstool-ng/ct-ng-final/.build/tools/bin'
16[DEBUG]  Creating script-override for 'install' -> '"/usr/bin/install -c"'
17[DEBUG]  ==> Executing: 'chmod' '700' '/home/ubuntu/build/crosstool-ng/ct-ng-final/.build/tools/bin/install'
18[DEBUG]  Creating script-override for 'bash' -> '"/bin/bash"'
19[DEBUG]  ==> Executing: 'chmod' '700' '/home/ubuntu/build/crosstool-ng/ct-ng-final/.build/tools/bin/bash'
20[DEBUG]  Creating script-override for 'awk' -> '"/usr/bin/awk"'
21[DEBUG]  ==> Executing: 'chmod' '700' '/home/ubuntu/build/crosstool-ng/ct-ng-final/.build/tools/bin/awk'
22[DEBUG]  Creating script-override for 'grep' -> '"/bin/grep"'
23[DEBUG]  ==> Executing: 'chmod' '700' '/home/ubuntu/build/crosstool-ng/ct-ng-final/.build/tools/bin/grep'
24[DEBUG]  Creating script-override for 'make' -> '"/usr/bin/make"'
25[DEBUG]  ==> Executing: 'chmod' '700' '/home/ubuntu/build/crosstool-ng/ct-ng-final/.build/tools/bin/make'
26[DEBUG]  Creating script-override for 'sed' -> '"/bin/sed"'
27[DEBUG]  ==> Executing: 'chmod' '700' '/home/ubuntu/build/crosstool-ng/ct-ng-final/.build/tools/bin/sed'
28[DEBUG]  Creating script-override for 'libtool' -> '"/usr/bin/libtool"'
29[DEBUG]  ==> Executing: 'chmod' '700' '/home/ubuntu/build/crosstool-ng/ct-ng-final/.build/tools/bin/libtool'
30[DEBUG]  Creating script-override for 'libtoolize' -> '"/usr/bin/libtoolize"'
31[DEBUG]  ==> Executing: 'chmod' '700' '/home/ubuntu/build/crosstool-ng/ct-ng-final/.build/tools/bin/libtoolize'
32[DEBUG]  Creating script-override for 'objcopy' -> '"/usr/bin/objcopy"'
33[DEBUG]  ==> Executing: 'chmod' '700' '/home/ubuntu/build/crosstool-ng/ct-ng-final/.build/tools/bin/objcopy'
34[DEBUG]  Creating script-override for 'objdump' -> '"/usr/bin/objdump"'
35[DEBUG]  ==> Executing: 'chmod' '700' '/home/ubuntu/build/crosstool-ng/ct-ng-final/.build/tools/bin/objdump'
36[DEBUG]  Creating script-override for 'readelf' -> '"/usr/bin/readelf"'
37[DEBUG]  ==> Executing: 'chmod' '700' '/home/ubuntu/build/crosstool-ng/ct-ng-final/.build/tools/bin/readelf'
38[DEBUG]  Creating script-override for 'patch' -> '"/usr/bin/patch"'
39[DEBUG]  ==> Executing: 'chmod' '700' '/home/ubuntu/build/crosstool-ng/ct-ng-final/.build/tools/bin/patch'
40[DEBUG]  Creating script-override for 'gperf' -> '"/usr/bin/gperf"'
41[DEBUG]  ==> Executing: 'chmod' '700' '/home/ubuntu/build/crosstool-ng/ct-ng-final/.build/tools/bin/gperf'
42[INFO ]  Build started 20000101.000000
43[DEBUG]  =================================================================
44[DEBUG]  Dumping user-supplied crosstool-NG configuration
45[DEBUG]    ==> Executing: 'grep' '-E' '^(# |)CT_' '.config'
46[DEBUG]    CT_CONFIGURE_has_xz=y
47[DEBUG]    CT_CONFIGURE_has_svn=y
48[DEBUG]    CT_MODULES=y
49[DEBUG]    # CT_OBSOLETE is not set
50[DEBUG]    CT_EXPERIMENTAL=y
51[DEBUG]    # CT_ALLOW_BUILD_AS_ROOT is not set
52[DEBUG]    # CT_DEBUG_CT is not set
53[DEBUG]    CT_LOCAL_TARBALLS_DIR="${HOME}/src"
54[DEBUG]    CT_SAVE_TARBALLS=y
55[DEBUG]    CT_CUSTOM_LOCATION_ROOT_DIR=""
56[DEBUG]    CT_WORK_DIR="${CT_TOP_DIR}/.build"
57[DEBUG]    CT_PREFIX_DIR="${HOME}/x-tools/${CT_TARGET}"
58[DEBUG]    CT_INSTALL_DIR="${CT_PREFIX_DIR}"
59[DEBUG]    CT_RM_RF_PREFIX_DIR=y
60[DEBUG]    CT_REMOVE_DOCS=y
61[DEBUG]    CT_INSTALL_DIR_RO=y
62[DEBUG]    CT_STRIP_ALL_TOOLCHAIN_EXECUTABLES=y
63[DEBUG]    # CT_FORBID_DOWNLOAD is not set
64[DEBUG]    # CT_FORCE_DOWNLOAD is not set
65[DEBUG]    CT_CONNECT_TIMEOUT=10
66[DEBUG]    # CT_ONLY_DOWNLOAD is not set
67[DEBUG]    # CT_USE_MIRROR is not set
68[DEBUG]    # CT_FORCE_EXTRACT is not set
69[DEBUG]    CT_OVERIDE_CONFIG_GUESS_SUB=y
70[DEBUG]    # CT_ONLY_EXTRACT is not set
71[DEBUG]    CT_PATCH_BUNDLED=y
72[DEBUG]    # CT_PATCH_LOCAL is not set
73[DEBUG]    # CT_PATCH_BUNDLED_LOCAL is not set
74[DEBUG]    # CT_PATCH_LOCAL_BUNDLED is not set
75[DEBUG]    # CT_PATCH_BUNDLED_FALLBACK_LOCAL is not set
76[DEBUG]    # CT_PATCH_LOCAL_FALLBACK_BUNDLED is not set
77[DEBUG]    # CT_PATCH_NONE is not set
78[DEBUG]    CT_PATCH_ORDER="bundled"
79[DEBUG]    CT_PARALLEL_JOBS=0
80[DEBUG]    CT_LOAD=""
81[DEBUG]    CT_USE_PIPES=y
82[DEBUG]    CT_EXTRA_CFLAGS_FOR_BUILD="-m32"
83[DEBUG]    CT_EXTRA_LDFLAGS_FOR_BUILD="-m32"
84[DEBUG]    CT_EXTRA_CFLAGS_FOR_HOST="-m32"
85[DEBUG]    CT_EXTRA_LDFLAGS_FOR_HOST="-m32"
86[DEBUG]    # CT_CONFIG_SHELL_SH is not set
87[DEBUG]    # CT_CONFIG_SHELL_ASH is not set
88[DEBUG]    CT_CONFIG_SHELL_BASH=y
89[DEBUG]    # CT_CONFIG_SHELL_CUSTOM is not set
90[DEBUG]    CT_CONFIG_SHELL="${bash}"
91[DEBUG]    # CT_LOG_ERROR is not set
92[DEBUG]    # CT_LOG_WARN is not set
93[DEBUG]    # CT_LOG_INFO is not set
94[DEBUG]    CT_LOG_EXTRA=y
95[DEBUG]    # CT_LOG_ALL is not set
96[DEBUG]    # CT_LOG_DEBUG is not set
97[DEBUG]    CT_LOG_LEVEL_MAX="EXTRA"
98[DEBUG]    # CT_LOG_SEE_TOOLS_WARN is not set
99[DEBUG]    CT_LOG_PROGRESS_BAR=y
100[DEBUG]    CT_LOG_TO_FILE=y
101[DEBUG]    CT_LOG_FILE_COMPRESS=y
102[DEBUG]    CT_ARCH="x86"
103[DEBUG]    CT_ARCH_SUPPORTS_32=y
104[DEBUG]    CT_ARCH_SUPPORTS_64=y
105[DEBUG]    CT_ARCH_SUPPORTS_WITH_ARCH=y
106[DEBUG]    CT_ARCH_SUPPORTS_WITH_CPU=y
107[DEBUG]    CT_ARCH_SUPPORTS_WITH_TUNE=y
108[DEBUG]    CT_ARCH_DEFAULT_32=y
109[DEBUG]    CT_ARCH_ARCH=""
110[DEBUG]    CT_ARCH_CPU=""
111[DEBUG]    CT_ARCH_TUNE="i686"
112[DEBUG]    CT_ARCH_32=y
113[DEBUG]    # CT_ARCH_64 is not set
114[DEBUG]    CT_ARCH_BITNESS=32
115[DEBUG]    CT_TARGET_CFLAGS=""
116[DEBUG]    CT_TARGET_LDFLAGS=""
117[DEBUG]    # CT_ARCH_alpha is not set
118[DEBUG]    # CT_ARCH_arm is not set
119[DEBUG]    # CT_ARCH_avr32 is not set
120[DEBUG]    # CT_ARCH_blackfin is not set
121[DEBUG]    # CT_ARCH_m68k is not set
122[DEBUG]    # CT_ARCH_microblaze is not set
123[DEBUG]    # CT_ARCH_mips is not set
124[DEBUG]    # CT_ARCH_powerpc is not set
125[DEBUG]    # CT_ARCH_s390 is not set
126[DEBUG]    # CT_ARCH_sh is not set
127[DEBUG]    # CT_ARCH_sparc is not set
128[DEBUG]    CT_ARCH_x86=y
129[DEBUG]    CT_ARCH_alpha_AVAILABLE=y
130[DEBUG]    CT_ARCH_arm_AVAILABLE=y
131[DEBUG]    CT_ARCH_avr32_AVAILABLE=y
132[DEBUG]    CT_ARCH_blackfin_AVAILABLE=y
133[DEBUG]    CT_ARCH_m68k_AVAILABLE=y
134[DEBUG]    CT_ARCH_microblaze_AVAILABLE=y
135[DEBUG]    CT_ARCH_mips_AVAILABLE=y
136[DEBUG]    CT_ARCH_powerpc_AVAILABLE=y
137[DEBUG]    CT_ARCH_s390_AVAILABLE=y
138[DEBUG]    CT_ARCH_sh_AVAILABLE=y
139[DEBUG]    CT_ARCH_sparc_AVAILABLE=y
140[DEBUG]    CT_ARCH_x86_AVAILABLE=y
141[DEBUG]    CT_ARCH_SUFFIX=""
142[DEBUG]    CT_MULTILIB=y
143[DEBUG]    CT_ARCH_USE_MMU=y
144[DEBUG]    CT_ARCH_32=y
145[DEBUG]    CT_ARCH_FLOAT=""
146[DEBUG]    CT_FORCE_SYSROOT=y
147[DEBUG]    CT_USE_SYSROOT=y
148[DEBUG]    CT_SYSROOT_NAME="sysroot"
149[DEBUG]    CT_SYSROOT_DIR_PREFIX=""
150[DEBUG]    # CT_STATIC_TOOLCHAIN is not set
151[DEBUG]    CT_TOOLCHAIN_PKGVERSION=""
152[DEBUG]    CT_TOOLCHAIN_BUGURL=""
153[DEBUG]    CT_TARGET_VENDOR="apple"
154[DEBUG]    CT_TARGET_ALIAS_SED_EXPR=""
155[DEBUG]    CT_TARGET_ALIAS=""
156[DEBUG]    # CT_NATIVE is not set
157[DEBUG]    CT_CROSS=y
158[DEBUG]    # CT_CROSS_NATIVE is not set
159[DEBUG]    # CT_CANADIAN is not set
160[DEBUG]    CT_TOOLCHAIN_TYPE="cross"
161[DEBUG]    CT_BUILD=""
162[DEBUG]    CT_BUILD_PREFIX=""
163[DEBUG]    CT_BUILD_SUFFIX=""
164[DEBUG]    # CT_TOOLCHAIN_ENABLE_NLS is not set
165[DEBUG]    # CT_DARWIN_COPY_SDK_TO_SYSROOT is not set
166[DEBUG]    CT_DARWIN=y
167[DEBUG]    CT_KERNEL_SUPPORTS_SHARED_LIBS=y
168[DEBUG]    CT_KERNEL="darwin"
169[DEBUG]    # CT_KERNEL_bare_metal is not set
170[DEBUG]    CT_KERNEL_darwin=y
171[DEBUG]    # CT_KERNEL_linux is not set
172[DEBUG]    # CT_KERNEL_mingw32 is not set
173[DEBUG]    # CT_KERNEL_windows is not set
174[DEBUG]    CT_KERNEL_bare_metal_AVAILABLE=y
175[DEBUG]    CT_KERNEL_darwin_AVAILABLE=y
176[DEBUG]    # CT_DARWIN_MAC_OSX_V_10_7 is not set
177[DEBUG]    CT_DARWIN_MAC_OSX_V_10_6=y
178[DEBUG]    # CT_DARWIN_IOS_V_5_0 is not set
179[DEBUG]    # CT_DARWIN_IOS_V_6_0 is not set
180[DEBUG]    # CT_DARWIN_IOS_V_6_1 is not set
181[DEBUG]    CT_DARWIN_VERSION="10"
182[DEBUG]    CT_DARWIN_SDK_PATH="${HOME}/MacOSX10.6.sdk"
183[DEBUG]    CT_DARWIN_SDK="MacOSX10.6.sdk"
184[DEBUG]    CT_KERNEL_linux_AVAILABLE=y
185[DEBUG]    CT_KERNEL_mingw32_AVAILABLE=y
186[DEBUG]    CT_KERNEL_windows_AVAILABLE=y
187[DEBUG]    CT_SHARED_LIBS=y
188[DEBUG]    CT_ARCH_BINFMT_MACH_O=y
189[DEBUG]    CT_BINUTILS="cctools"
190[DEBUG]    CT_BINUTILS_cctools=y
191[DEBUG]    CT_BINUTILS_VERSION="809"
192[DEBUG]    CT_CCTOOLS_V_809=y
193[DEBUG]    # CT_CCTOOLS_V_806 is not set
194[DEBUG]    # CT_CC_clang is not set
195[DEBUG]    CT_CC_gcc=y
196[DEBUG]    CT_CC_GCC_V_apple_5666_3=y
197[DEBUG]    CT_CC_GCC_APPLE=y
198[DEBUG]    # CT_CC_GCC_USE_GRAPHITE is not set
199[DEBUG]    # CT_CC_GCC_USE_LTO is not set
200[DEBUG]    CT_CC_GCC_VERSION="5666.3"
201[DEBUG]    # CT_CC_LANG_FORTRAN is not set
202[DEBUG]    CT_CC_GCC_ENABLE_CXX_FLAGS=""
203[DEBUG]    CT_CC_GCC_CORE_EXTRA_CONFIG_ARRAY=""
204[DEBUG]    CT_CC_GCC_EXTRA_CONFIG_ARRAY=""
205[DEBUG]    # CT_CC_GCC_SYSTEM_ZLIB is not set
206[DEBUG]    CT_CC_GCC_ENABLE_TARGET_OPTSPACE=y
207[DEBUG]    # CT_CC_GCC_LIBMUDFLAP is not set
208[DEBUG]    # CT_CC_GCC_LIBGOMP is not set
209[DEBUG]    # CT_CC_GCC_LIBSSP is not set
210[DEBUG]    CT_CC_CXA_ATEXIT=y
211[DEBUG]    # CT_CC_GCC_DISABLE_PCH is not set
212[DEBUG]    CT_CC_GCC_SJLJ_EXCEPTIONS=m
213[DEBUG]    # CT_CC_llvmgcc is not set
214[DEBUG]    CT_CC_SUPPORT_CXX=y
215[DEBUG]    CT_CC_SUPPORT_FORTRAN=y
216[DEBUG]    CT_CC_SUPPORT_JAVA=y
217[DEBUG]    CT_CC_SUPPORT_ADA=y
218[DEBUG]    CT_CC_SUPPORT_OBJC=y
219[DEBUG]    CT_CC_SUPPORT_OBJCXX=y
220[DEBUG]    CT_CC_LANG_CXX=y
221[DEBUG]    # CT_CC_LANG_JAVA is not set
222[DEBUG]    # CT_CC_LANG_ADA is not set
223[DEBUG]    CT_CC_LANG_OBJC=y
224[DEBUG]    CT_CC_LANG_OBJCXX=y
225[DEBUG]    CT_CC_LANG_OTHERS=""
226[DEBUG]    CT_LIBC="none"
227[DEBUG]    CT_LIBC_none=y
228[DEBUG]    CT_LIBC_eglibc_AVAILABLE=y
229[DEBUG]    CT_LIBC_glibc_AVAILABLE=y
230[DEBUG]    CT_LIBC_mingw_AVAILABLE=y
231[DEBUG]    CT_LIBC_newlib_AVAILABLE=y
232[DEBUG]    CT_LIBC_none_AVAILABLE=y
233[DEBUG]    CT_LIBC_uClibc_AVAILABLE=y
234[DEBUG]    CT_THREADS="nptl"
235[DEBUG]    # CT_DEBUG_dmalloc is not set
236[DEBUG]    # CT_DEBUG_duma is not set
237[DEBUG]    # CT_DEBUG_gdb is not set
238[DEBUG]    # CT_DEBUG_ltrace is not set
239[DEBUG]    # CT_DEBUG_strace is not set
240[DEBUG]    CT_COMPLIBS_NEEDED=y
241[DEBUG]    CT_GMP_NEEDED=y
242[DEBUG]    CT_MPFR_NEEDED=y
243[DEBUG]    CT_LLVM_NEEDED=y
244[DEBUG]    CT_OPENSSL_NEEDED=y
245[DEBUG]    CT_LIBUUID_NEEDED=y
246[DEBUG]    CT_COMPLIBS=y
247[DEBUG]    CT_GMP=y
248[DEBUG]    CT_MPFR=y
249[DEBUG]    CT_LLVM=y
250[DEBUG]    CT_OPENSSL=y
251[DEBUG]    CT_LIBUUID=y
252[DEBUG]    CT_GMP_V_5_1_1=y
253[DEBUG]    # CT_GMP_V_5_0_2 is not set
254[DEBUG]    # CT_GMP_V_5_0_1 is not set
255[DEBUG]    # CT_GMP_V_4_3_2 is not set
256[DEBUG]    # CT_GMP_V_4_3_1 is not set
257[DEBUG]    # CT_GMP_V_4_3_0 is not set
258[DEBUG]    CT_GMP_VERSION="5.1.1"
259[DEBUG]    CT_MPFR_V_3_1_2=y
260[DEBUG]    # CT_MPFR_V_3_1_0 is not set
261[DEBUG]    # CT_MPFR_V_3_0_1 is not set
262[DEBUG]    # CT_MPFR_V_3_0_0 is not set
263[DEBUG]    # CT_MPFR_V_2_4_2 is not set
264[DEBUG]    # CT_MPFR_V_2_4_1 is not set
265[DEBUG]    # CT_MPFR_V_2_4_0 is not set
266[DEBUG]    CT_MPFR_VERSION="3.1.2"
267[DEBUG]    CT_LIBUUID_E2FSPROGSLIBS=y
268[DEBUG]    # CT_LIBUUID_UTILLINUX is not set
269[DEBUG]    CT_LIBUUID_E2FSPROGSLIBS_V_1_41_14=y
270[DEBUG]    CT_LIBUUID_E2FSPROGSLIBS_VERSION="1.41.14"
271[DEBUG]    CT_OPENSSL_V_1_0_1_E=y
272[DEBUG]    # CT_OPENSSL_V_1_0_1_C is not set
273[DEBUG]    # CT_OPENSSL_V_1_0_1_B is not set
274[DEBUG]    CT_OPENSSL_VERSION="1.0.1e"
275[DEBUG]    # CT_LLVM_V_3_1 is not set
276[DEBUG]    # CT_LLVM_V_3_0 is not set
277[DEBUG]    # CT_LLVM_V_2_9 is not set
278[DEBUG]    # CT_LLVM_V_2_8 is not set
279[DEBUG]    CT_LLVM_V_2_7=y
280[DEBUG]    CT_LLVM_VERSION="2.7"
281[DEBUG]    # CT_COMPLIBS_CHECK is not set
282[DEBUG]    # CT_COMP_TOOLS is not set
283[DEBUG]    # CT_TEST_SUITE_GCC is not set
284[DEBUG]  Dumping user-supplied crosstool-NG configuration: done in 0.12s (at 00:00)
285[DEBUG]  Unsetting and unexporting MAKEFLAGS
286[INFO ]  Building environment variables
287[DEBUG]  Disabling companion tools 'make'
288[DEBUG]  Disabling companion tools 'm4'
289[DEBUG]  Disabling companion tools 'autoconf'
290[DEBUG]  Disabling companion tools 'automake'
291[DEBUG]  Disabling companion tools 'libtool'
292[DEBUG]  Disabling cc 'clang'
293[DEBUG]  Enabling cc 'gcc'
294[DEBUG]  Disabling cc 'llvmgcc'
295[DEBUG]  Disabling debug 'template'
296[DEBUG]  Disabling debug 'dmalloc'
297[DEBUG]  Disabling debug 'duma'
298[DEBUG]  Disabling debug 'gdb'
299[DEBUG]  Disabling debug 'ltrace'
300[DEBUG]  Disabling debug 'strace'
301[DEBUG]  Disabling test suite 'gcc'
302[DEBUG]  Testing '! ( -z /home/ubuntu/x-tools/i686-apple-darwin10 )'
303[WARN ]  Directory '/home/ubuntu/src' does not exist.
304[WARN ]  Will not save downloaded tarballs to local storage.
305[EXTRA]  Preparing working directories
306[DEBUG]  ==> Executing: 'mkdir' '-p' '/home/ubuntu/build/crosstool-ng/ct-ng-final/.build/tarballs'
307[DEBUG]  ==> Executing: 'mkdir' '-p' '/home/ubuntu/build/crosstool-ng/ct-ng-final/.build/src'
308[DEBUG]  ==> Executing: 'mkdir' '-p' '/home/ubuntu/build/crosstool-ng/ct-ng-final/.build/i686-apple-darwin10/build'
309[DEBUG]  ==> Executing: 'mkdir' '-p' '/home/ubuntu/build/crosstool-ng/ct-ng-final/.build/i686-apple-darwin10/buildtools/bin'
310[DEBUG]  ==> Executing: 'mkdir' '-p' '/home/ubuntu/build/crosstool-ng/ct-ng-final/.build/i686-apple-darwin10/build/configs'
311[DEBUG]  ==> Executing: 'mkdir' '-p' '/home/ubuntu/x-tools/i686-apple-darwin10'
312[DEBUG]  ==> Executing: 'mkdir' '-p' '/home/ubuntu/x-tools/i686-apple-darwin10'
313[DEBUG]  ==> Executing: 'mkdir' '-p' '/home/ubuntu/build/crosstool-ng/ct-ng-final/.build/i686-apple-darwin10/buildtools'
314[DEBUG]  ==> Executing: 'touch' '/home/ubuntu/x-tools/i686-apple-darwin10/foo'
315[DEBUG]  Testing '! ( -f /home/ubuntu/x-tools/i686-apple-darwin10/FOO )'
316[DEBUG]  ==> Executing: 'rm' '-f' '/home/ubuntu/x-tools/i686-apple-darwin10/foo'
317[DEBUG]  ==> Executing: 'chmod' '-R' 'u+w' '/home/ubuntu/x-tools/i686-apple-darwin10' '/home/ubuntu/x-tools/i686-apple-darwin10'
318[DEBUG]  Sanitised 'CT_SYSROOT_REL_DIR': 'sysroot' -> 'sysroot'
319[DEBUG]  Sanitised 'CT_SYSROOT_DIR': '/home/ubuntu/x-tools/i686-apple-darwin10/i686-apple-darwin10/sysroot' -> '/home/ubuntu/x-tools/i686-apple-darwin10/i686-apple-darwin10/sysroot'
320[DEBUG]  Sanitised 'CT_DEBUGROOT_DIR': '/home/ubuntu/x-tools/i686-apple-darwin10/i686-apple-darwin10//debug-root' -> '/home/ubuntu/x-tools/i686-apple-darwin10/i686-apple-darwin10/debug-root'
321[DEBUG]  Sanitised 'CT_HEADERS_DIR': '/home/ubuntu/x-tools/i686-apple-darwin10/i686-apple-darwin10/sysroot/usr/include' -> '/home/ubuntu/x-tools/i686-apple-darwin10/i686-apple-darwin10/sysroot/usr/include'
322[DEBUG]  ==> Executing: 'mkdir' '-p' '/home/ubuntu/x-tools/i686-apple-darwin10/i686-apple-darwin10/sysroot'
323[DEBUG]  ==> Executing: 'mkdir' '-p' '/home/ubuntu/x-tools/i686-apple-darwin10/i686-apple-darwin10/debug-root'
324[DEBUG]  ==> Executing: 'mkdir' '-p' '/home/ubuntu/x-tools/i686-apple-darwin10/lib'
325[DEBUG]  ==> Executing: 'mkdir' '-p' '/home/ubuntu/x-tools/i686-apple-darwin10/i686-apple-darwin10/sysroot/lib'
326[DEBUG]  ==> Executing: 'mkdir' '-p' '/home/ubuntu/x-tools/i686-apple-darwin10/i686-apple-darwin10/sysroot/usr/lib'
327[DEBUG]  ==> Executing: 'mkdir' '-p' '/home/ubuntu/x-tools/i686-apple-darwin10/i686-apple-darwin10/sysroot/usr/include'
328[DEBUG]  Entering '/home/ubuntu/x-tools/i686-apple-darwin10/i686-apple-darwin10'
329[DEBUG]  ==> Executing: 'ln' '-sf' 'sysroot/lib' 'lib'
330[DEBUG]  ==> Executing: 'ln' '-sf' 'lib' '/home/ubuntu/x-tools/i686-apple-darwin10/lib32'
331[DEBUG]  ==> Executing: 'ln' '-sf' 'lib' '/home/ubuntu/x-tools/i686-apple-darwin10/lib64'
332[DEBUG]  ==> Executing: 'ln' '-sf' 'lib' '/home/ubuntu/x-tools/i686-apple-darwin10/i686-apple-darwin10/sysroot/lib32'
333[DEBUG]  ==> Executing: 'ln' '-sf' 'lib' '/home/ubuntu/x-tools/i686-apple-darwin10/i686-apple-darwin10/sysroot/lib64'
334[DEBUG]  ==> Executing: 'ln' '-sf' 'lib' '/home/ubuntu/x-tools/i686-apple-darwin10/i686-apple-darwin10/sysroot/usr/lib32'
335[DEBUG]  ==> Executing: 'ln' '-sf' 'lib' '/home/ubuntu/x-tools/i686-apple-darwin10/i686-apple-darwin10/sysroot/usr/lib64'
336[DEBUG]  ==> Executing: 'ln' '-sf' 'lib' '/home/ubuntu/x-tools/i686-apple-darwin10/i686-apple-darwin10/lib32'
337[DEBUG]  ==> Executing: 'ln' '-sf' 'lib' '/home/ubuntu/x-tools/i686-apple-darwin10/i686-apple-darwin10/lib64'
338[DEBUG]  Making build system tools available
339[DEBUG]    'i686-build_pc-linux-gnu-ar' -> '/usr/bin/ar'
340[DEBUG]  ==> Executing: 'chmod' '700' '/home/ubuntu/build/crosstool-ng/ct-ng-final/.build/i686-apple-darwin10/buildtools/bin/i686-build_pc-linux-gnu-ar'
341[ALL  ]  export 'AR=i686-build_pc-linux-gnu-ar'
342[DEBUG]    'i686-build_pc-linux-gnu-as' -> '/usr/bin/as'
343[DEBUG]  ==> Executing: 'chmod' '700' '/home/ubuntu/build/crosstool-ng/ct-ng-final/.build/i686-apple-darwin10/buildtools/bin/i686-build_pc-linux-gnu-as'
344[ALL  ]  export 'AS=i686-build_pc-linux-gnu-as'
345[DEBUG]    Missing: 'i686-pc-linux-gnu-dlltool' or 'i686-pc-linux-gnu-dlltool' or 'dlltool' : not required.
346[DEBUG]    'i686-build_pc-linux-gnu-gcc' -> '/usr/bin/gcc'
347[DEBUG]  ==> Executing: 'chmod' '700' '/home/ubuntu/build/crosstool-ng/ct-ng-final/.build/i686-apple-darwin10/buildtools/bin/i686-build_pc-linux-gnu-gcc'
348[ALL  ]  export 'CC=i686-build_pc-linux-gnu-gcc'
349[DEBUG]    'i686-build_pc-linux-gnu-g++' -> '/usr/bin/g++'
350[DEBUG]  ==> Executing: 'chmod' '700' '/home/ubuntu/build/crosstool-ng/ct-ng-final/.build/i686-apple-darwin10/buildtools/bin/i686-build_pc-linux-gnu-g++'
351[ALL  ]  export 'CXX=i686-build_pc-linux-gnu-g++'
352[DEBUG]    'i686-build_pc-linux-gnu-c++' -> '/usr/bin/c++'
353[DEBUG]  ==> Executing: 'chmod' '700' '/home/ubuntu/build/crosstool-ng/ct-ng-final/.build/i686-apple-darwin10/buildtools/bin/i686-build_pc-linux-gnu-c++'
354[DEBUG]  Testing '! (  = y )'
355[DEBUG]    Missing: 'i686-pc-linux-gnu-gnatbind' or 'i686-pc-linux-gnu-gnatbind' or 'gnatbind' : not required.
356[DEBUG]    Missing: 'i686-pc-linux-gnu-gnatmake' or 'i686-pc-linux-gnu-gnatmake' or 'gnatmake' : not required.
357[DEBUG]    'i686-build_pc-linux-gnu-ld' -> '/usr/bin/ld'
358[DEBUG]  ==> Executing: 'chmod' '700' '/home/ubuntu/build/crosstool-ng/ct-ng-final/.build/i686-apple-darwin10/buildtools/bin/i686-build_pc-linux-gnu-ld'
359[ALL  ]  export 'LD=i686-build_pc-linux-gnu-ld'
360[DEBUG]    'i686-build_pc-linux-gnu-nm' -> '/usr/bin/nm'
361[DEBUG]  ==> Executing: 'chmod' '700' '/home/ubuntu/build/crosstool-ng/ct-ng-final/.build/i686-apple-darwin10/buildtools/bin/i686-build_pc-linux-gnu-nm'
362[ALL  ]  export 'NM=i686-build_pc-linux-gnu-nm'
363[DEBUG]    'i686-build_pc-linux-gnu-objcopy' -> '/home/ubuntu/build/crosstool-ng/ct-ng-final/.build/tools/bin/objcopy'
364[DEBUG]  ==> Executing: 'chmod' '700' '/home/ubuntu/build/crosstool-ng/ct-ng-final/.build/i686-apple-darwin10/buildtools/bin/i686-build_pc-linux-gnu-objcopy'
365[ALL  ]  export 'OBJCOPY=i686-build_pc-linux-gnu-objcopy'
366[DEBUG]    'i686-build_pc-linux-gnu-objdump' -> '/home/ubuntu/build/crosstool-ng/ct-ng-final/.build/tools/bin/objdump'
367[DEBUG]  ==> Executing: 'chmod' '700' '/home/ubuntu/build/crosstool-ng/ct-ng-final/.build/i686-apple-darwin10/buildtools/bin/i686-build_pc-linux-gnu-objdump'
368[ALL  ]  export 'OBJDUMP=i686-build_pc-linux-gnu-objdump'
369[DEBUG]    'i686-build_pc-linux-gnu-ranlib' -> '/usr/bin/ranlib'
370[DEBUG]  ==> Executing: 'chmod' '700' '/home/ubuntu/build/crosstool-ng/ct-ng-final/.build/i686-apple-darwin10/buildtools/bin/i686-build_pc-linux-gnu-ranlib'
371[ALL  ]  export 'RANLIB=i686-build_pc-linux-gnu-ranlib'
372[DEBUG]    'i686-build_pc-linux-gnu-strip' -> '/usr/bin/strip'
373[DEBUG]  ==> Executing: 'chmod' '700' '/home/ubuntu/build/crosstool-ng/ct-ng-final/.build/i686-apple-darwin10/buildtools/bin/i686-build_pc-linux-gnu-strip'
374[ALL  ]  export 'STRIP=i686-build_pc-linux-gnu-strip'
375[DEBUG]    Missing: 'i686-pc-linux-gnu-windres' or 'i686-pc-linux-gnu-windres' or 'windres' : not required.
376[DEBUG]    'i686-build_pc-linux-gnu-ar' -> '/usr/bin/ar'
377[DEBUG]  ==> Executing: 'chmod' '700' '/home/ubuntu/build/crosstool-ng/ct-ng-final/.build/i686-apple-darwin10/buildtools/bin/i686-build_pc-linux-gnu-ar'
378[ALL  ]  export 'AR=i686-build_pc-linux-gnu-ar'
379[DEBUG]    'i686-build_pc-linux-gnu-as' -> '/usr/bin/as'
380[DEBUG]  ==> Executing: 'chmod' '700' '/home/ubuntu/build/crosstool-ng/ct-ng-final/.build/i686-apple-darwin10/buildtools/bin/i686-build_pc-linux-gnu-as'
381[ALL  ]  export 'AS=i686-build_pc-linux-gnu-as'
382[DEBUG]    Missing: 'i686-pc-linux-gnu-dlltool' or 'i686-pc-linux-gnu-dlltool' or 'dlltool' : not required.
383[DEBUG]    'i686-build_pc-linux-gnu-gcc' -> '/usr/bin/gcc'
384[DEBUG]  ==> Executing: 'chmod' '700' '/home/ubuntu/build/crosstool-ng/ct-ng-final/.build/i686-apple-darwin10/buildtools/bin/i686-build_pc-linux-gnu-gcc'
385[ALL  ]  export 'CC=i686-build_pc-linux-gnu-gcc'
386[DEBUG]    'i686-build_pc-linux-gnu-g++' -> '/usr/bin/g++'
387[DEBUG]  ==> Executing: 'chmod' '700' '/home/ubuntu/build/crosstool-ng/ct-ng-final/.build/i686-apple-darwin10/buildtools/bin/i686-build_pc-linux-gnu-g++'
388[ALL  ]  export 'CXX=i686-build_pc-linux-gnu-g++'
389[DEBUG]    'i686-build_pc-linux-gnu-c++' -> '/usr/bin/c++'
390[DEBUG]  ==> Executing: 'chmod' '700' '/home/ubuntu/build/crosstool-ng/ct-ng-final/.build/i686-apple-darwin10/buildtools/bin/i686-build_pc-linux-gnu-c++'
391[DEBUG]  Testing '! (  = y )'
392[DEBUG]    Missing: 'i686-pc-linux-gnu-gnatbind' or 'i686-pc-linux-gnu-gnatbind' or 'gnatbind' : not required.
393[DEBUG]    Missing: 'i686-pc-linux-gnu-gnatmake' or 'i686-pc-linux-gnu-gnatmake' or 'gnatmake' : not required.
394[DEBUG]    'i686-build_pc-linux-gnu-ld' -> '/usr/bin/ld'
395[DEBUG]  ==> Executing: 'chmod' '700' '/home/ubuntu/build/crosstool-ng/ct-ng-final/.build/i686-apple-darwin10/buildtools/bin/i686-build_pc-linux-gnu-ld'
396[ALL  ]  export 'LD=i686-build_pc-linux-gnu-ld'
397[DEBUG]    'i686-build_pc-linux-gnu-nm' -> '/usr/bin/nm'
398[DEBUG]  ==> Executing: 'chmod' '700' '/home/ubuntu/build/crosstool-ng/ct-ng-final/.build/i686-apple-darwin10/buildtools/bin/i686-build_pc-linux-gnu-nm'
399[ALL  ]  export 'NM=i686-build_pc-linux-gnu-nm'
400[DEBUG]    'i686-build_pc-linux-gnu-objcopy' -> '/home/ubuntu/build/crosstool-ng/ct-ng-final/.build/tools/bin/objcopy'
401[DEBUG]  ==> Executing: 'chmod' '700' '/home/ubuntu/build/crosstool-ng/ct-ng-final/.build/i686-apple-darwin10/buildtools/bin/i686-build_pc-linux-gnu-objcopy'
402[ALL  ]  export 'OBJCOPY=i686-build_pc-linux-gnu-objcopy'
403[DEBUG]    'i686-build_pc-linux-gnu-objdump' -> '/home/ubuntu/build/crosstool-ng/ct-ng-final/.build/tools/bin/objdump'
404[DEBUG]  ==> Executing: 'chmod' '700' '/home/ubuntu/build/crosstool-ng/ct-ng-final/.build/i686-apple-darwin10/buildtools/bin/i686-build_pc-linux-gnu-objdump'
405[ALL  ]  export 'OBJDUMP=i686-build_pc-linux-gnu-objdump'
406[DEBUG]    'i686-build_pc-linux-gnu-ranlib' -> '/usr/bin/ranlib'
407[DEBUG]  ==> Executing: 'chmod' '700' '/home/ubuntu/build/crosstool-ng/ct-ng-final/.build/i686-apple-darwin10/buildtools/bin/i686-build_pc-linux-gnu-ranlib'
408[ALL  ]  export 'RANLIB=i686-build_pc-linux-gnu-ranlib'
409[DEBUG]    'i686-build_pc-linux-gnu-strip' -> '/usr/bin/strip'
410[DEBUG]  ==> Executing: 'chmod' '700' '/home/ubuntu/build/crosstool-ng/ct-ng-final/.build/i686-apple-darwin10/buildtools/bin/i686-build_pc-linux-gnu-strip'
411[ALL  ]  export 'STRIP=i686-build_pc-linux-gnu-strip'
412[DEBUG]    Missing: 'i686-pc-linux-gnu-windres' or 'i686-pc-linux-gnu-windres' or 'windres' : not required.
413[DEBUG]    'makeinfo' -> '/usr/bin/makeinfo'
414[DEBUG]  ==> Executing: 'chmod' '700' '/home/ubuntu/build/crosstool-ng/ct-ng-final/.build/i686-apple-darwin10/buildtools/bin/makeinfo'
415[DEBUG]  CFLAGS for host compiler: '-O2 -g -pipe -m32'
416[DEBUG]  LDFLAGS for host compiler: ' -m32'
417[DEBUG]  =================================================================
418[DEBUG]  Checking that we can run gcc -v
419[DEBUG]    ==> Executing: 'i686-build_pc-linux-gnu-gcc' '-v'
420[DEBUG]    Using built-in specs.
421[DEBUG]    COLLECT_GCC=/usr/bin/gcc
422[DEBUG]    COLLECT_LTO_WRAPPER=/usr/lib/gcc/i686-linux-gnu/4.6/lto-wrapper
423[DEBUG]    Target: i686-linux-gnu
424[DEBUG]    Configured with: ../src/configure -v --with-pkgversion='Ubuntu/Linaro 4.6.3-1ubuntu5' --with-bugurl=file:///usr/share/doc/gcc-4.6/README.Bugs --enable-languages=c,c++,fortran,objc,obj-c++ --prefix=/usr --program-suffix=-4.6 --enable-shared --enable-linker-build-id --with-system-zlib --libexecdir=/usr/lib --without-included-gettext --enable-threads=posix --with-gxx-include-dir=/usr/include/c++/4.6 --libdir=/usr/lib --enable-nls --with-sysroot=/ --enable-clocale=gnu --enable-libstdcxx-debug --enable-libstdcxx-time=yes --enable-gnu-unique-object --enable-plugin --enable-objc-gc --enable-targets=all --disable-werror --with-arch-32=i686 --with-tune=generic --enable-checking=release --build=i686-linux-gnu --host=i686-linux-gnu --target=i686-linux-gnu
425[DEBUG]    Thread model: posix
426[DEBUG]    gcc version 4.6.3 (Ubuntu/Linaro 4.6.3-1ubuntu5)
427[DEBUG]  Checking that we can run gcc -v: done in 0.03s (at 00:00)
428[DEBUG]  =================================================================
429[DEBUG]  Checking that gcc can compile a trivial program
430[DEBUG]    ==> Executing: 'i686-build_pc-linux-gnu-gcc' '-O2' '-g' '-pipe' '-m32' '-m32' '/home/ubuntu/build/crosstool-ng/ct-ng-final/.build/i686-apple-darwin10/build/test.c' '-o' '/home/ubuntu/build/crosstool-ng/ct-ng-final/.build/i686-apple-darwin10/build/.gccout'
431[DEBUG]  Checking that gcc can compile a trivial program: done in -0000000000000000000000.92s (at 00:00)
432[EXTRA]  Installing user-supplied crosstool-NG configuration
433[DEBUG]  ==> Executing: 'mkdir' '-p' '/home/ubuntu/x-tools/i686-apple-darwin10/bin'
434[DEBUG]  ==> Executing: 'install' '-m' '0755' '/usr/local/lib/ct-ng.hg+unknown-20000101.000000/scripts/toolchain-config.in' '/home/ubuntu/x-tools/i686-apple-darwin10/bin/i686-apple-darwin10-ct-ng.config'
435[DEBUG]  ==> Executing: 'sed' '-i' '-e' 's,@@grep@@,"/bin/grep",;' '/home/ubuntu/x-tools/i686-apple-darwin10/bin/i686-apple-darwin10-ct-ng.config'
436[EXTRA]  =================================================================
437[EXTRA]  Dumping internal crosstool-NG configuration
438[EXTRA]    Building a toolchain for:
439[EXTRA]      build  = i686-pc-linux-gnu
440[EXTRA]      host   = i686-pc-linux-gnu
441[EXTRA]      target = i686-apple-darwin10
442[DEBUG]    CT_ARCH=x86
443[DEBUG]    CT_ARCH_32=y
444[DEBUG]    CT_ARCH_ARCH=
445[DEBUG]    CT_ARCH_BINFMT_MACH_O=y
446[DEBUG]    CT_ARCH_BITNESS=32
447[DEBUG]    CT_ARCH_CPU=
448[DEBUG]    CT_ARCH_DEFAULT_32=y
449[DEBUG]    CT_ARCH_FLOAT=
450[DEBUG]    CT_ARCH_SUFFIX=
451[DEBUG]    CT_ARCH_SUPPORTS_32=y
452[DEBUG]    CT_ARCH_SUPPORTS_64=y
453[DEBUG]    CT_ARCH_SUPPORTS_WITH_ARCH=y
454[DEBUG]    CT_ARCH_SUPPORTS_WITH_CPU=y
455[DEBUG]    CT_ARCH_SUPPORTS_WITH_TUNE=y
456[DEBUG]    CT_ARCH_TARGET_CFLAGS='     -mtune=i686  '
457[DEBUG]    CT_ARCH_TARGET_LDFLAGS=' '
458[DEBUG]    CT_ARCH_TUNE=i686
459[DEBUG]    CT_ARCH_TUNE_CFLAG=-mtune=i686
460[DEBUG]    CT_ARCH_USE_MMU=y
461[DEBUG]    CT_ARCH_WITH_TUNE=--with-tune=i686
462[DEBUG]    CT_ARCH_alpha_AVAILABLE=y
463[DEBUG]    CT_ARCH_arm_AVAILABLE=y
464[DEBUG]    CT_ARCH_avr32_AVAILABLE=y
465[DEBUG]    CT_ARCH_blackfin_AVAILABLE=y
466[DEBUG]    CT_ARCH_m68k_AVAILABLE=y
467[DEBUG]    CT_ARCH_microblaze_AVAILABLE=y
468[DEBUG]    CT_ARCH_mips_AVAILABLE=y
469[DEBUG]    CT_ARCH_powerpc_AVAILABLE=y
470[DEBUG]    CT_ARCH_s390_AVAILABLE=y
471[DEBUG]    CT_ARCH_sh_AVAILABLE=y
472[DEBUG]    CT_ARCH_sparc_AVAILABLE=y
473[DEBUG]    CT_ARCH_x86=y
474[DEBUG]    CT_ARCH_x86_AVAILABLE=y
475[DEBUG]    CT_BINUTILS=cctools
476[DEBUG]    CT_BINUTILS_VERSION=809
477[DEBUG]    CT_BINUTILS_cctools=y
478[DEBUG]    CT_BUILD=i686-build_pc-linux-gnu
479[DEBUG]    CT_BUILDTOOLS_PREFIX_DIR=/home/ubuntu/build/crosstool-ng/ct-ng-final/.build/i686-apple-darwin10/buildtools
480[DEBUG]    CT_BUILD_DIR=/home/ubuntu/build/crosstool-ng/ct-ng-final/.build/i686-apple-darwin10/build
481[DEBUG]    CT_BUILD_PREFIX=
482[DEBUG]    CT_BUILD_SUFFIX=
483[DEBUG]    CT_CCTOOLS_V_809=y
484[DEBUG]    CT_CC_CXA_ATEXIT=y
485[DEBUG]    CT_CC_FACILITY_LIST=' gcc'
486[DEBUG]    CT_CC_GCC_APPLE=y
487[DEBUG]    CT_CC_GCC_CORE_EXTRA_CONFIG_ARRAY=()
488[DEBUG]    CT_CC_GCC_ENABLE_CXX_FLAGS=
489[DEBUG]    CT_CC_GCC_ENABLE_TARGET_OPTSPACE=y
490[DEBUG]    CT_CC_GCC_EXTRA_CONFIG_ARRAY=()
491[DEBUG]    CT_CC_GCC_SJLJ_EXCEPTIONS=m
492[DEBUG]    CT_CC_GCC_VERSION=5666.3
493[DEBUG]    CT_CC_GCC_V_apple_5666_3=y
494[DEBUG]    CT_CC_LANG_CXX=y
495[DEBUG]    CT_CC_LANG_OBJC=y
496[DEBUG]    CT_CC_LANG_OBJCXX=y
497[DEBUG]    CT_CC_LANG_OTHERS=
498[DEBUG]    CT_CC_LLVMGCC_CORE_EXTRA_CONFIG_ARRAY=()
499[DEBUG]    CT_CC_LLVMGCC_EXTRA_CONFIG_ARRAY=()
500[DEBUG]    CT_CC_SUPPORT_ADA=y
501[DEBUG]    CT_CC_SUPPORT_CXX=y
502[DEBUG]    CT_CC_SUPPORT_FORTRAN=y
503[DEBUG]    CT_CC_SUPPORT_JAVA=y
504[DEBUG]    CT_CC_SUPPORT_OBJC=y
505[DEBUG]    CT_CC_SUPPORT_OBJCXX=y
506[DEBUG]    CT_CC_gcc=y
507[DEBUG]    CT_CFLAGS_FOR_BUILD='-O2 -g -m32'
508[DEBUG]    CT_CFLAGS_FOR_HOST='-O2 -g -pipe -m32'
509[DEBUG]    CT_COMPLIBS=y
510[DEBUG]    CT_COMPLIBS_NEEDED=y
511[DEBUG]    CT_COMP_LIBS_FACILITY_LIST=' gmp mpfr ppl isl cloog mpc llvm libelf libuuid openssl'
512[DEBUG]    CT_COMP_TOOLS_FACILITY_LIST=
513[DEBUG]    CT_CONFIGURE_has_svn=y
514[DEBUG]    CT_CONFIGURE_has_xz=y
515[DEBUG]    CT_CONFIG_DIR=/home/ubuntu/build/crosstool-ng/ct-ng-final/.build/i686-apple-darwin10/build/configs
516[DEBUG]    CT_CONFIG_SHELL=/bin/bash
517[DEBUG]    CT_CONFIG_SHELL_BASH=y
518[DEBUG]    CT_CONNECT_TIMEOUT=10
519[DEBUG]    CT_CROSS=y
520[DEBUG]    CT_CUSTOM_LOCATION_ROOT_DIR=
521[DEBUG]    CT_DARWIN=y
522[DEBUG]    CT_DARWIN_MAC_OSX_V_10_6=y
523[DEBUG]    CT_DARWIN_SDK=MacOSX10.6.sdk
524[DEBUG]    CT_DARWIN_SDK_PATH=/home/ubuntu/MacOSX10.6.sdk
525[DEBUG]    CT_DARWIN_VERSION=10
526[DEBUG]    CT_DEBUGROOT_DIR=/home/ubuntu/x-tools/i686-apple-darwin10/i686-apple-darwin10/debug-root
527[DEBUG]    CT_DEBUG_FACILITY_LIST=
528[DEBUG]    CT_DOC_DIR=/usr/local/share/doc/crosstool-ng/ct-ng.hg+unknown-20000101.000000
529[DEBUG]    CT_DYLD_VERSION=210.2.3
530[DEBUG]    CT_EXPERIMENTAL=y
531[DEBUG]    CT_EXPORT_BUILD_TOOLS=yes
532[DEBUG]    CT_EXTRA_CFLAGS_FOR_BUILD=-m32
533[DEBUG]    CT_EXTRA_CFLAGS_FOR_HOST=-m32
534[DEBUG]    CT_EXTRA_LDFLAGS_FOR_BUILD=-m32
535[DEBUG]    CT_EXTRA_LDFLAGS_FOR_HOST=-m32
536[DEBUG]    CT_FORCE_SYSROOT=y
537[DEBUG]    CT_GMP=y
538[DEBUG]    CT_GMP_NEEDED=y
539[DEBUG]    CT_GMP_VERSION=5.1.1
540[DEBUG]    CT_GMP_V_5_1_1=y
541[DEBUG]    CT_HEADERS_DIR=/home/ubuntu/x-tools/i686-apple-darwin10/i686-apple-darwin10/sysroot/usr/include
542[DEBUG]    CT_HOST=i686-build_pc-linux-gnu
543[DEBUG]    CT_HOST_COMPLIBS_DIR=/home/ubuntu/build/crosstool-ng/ct-ng-final/.build/i686-apple-darwin10/buildtools
544[DEBUG]    CT_INSTALL_DIR=/home/ubuntu/x-tools/i686-apple-darwin10
545[DEBUG]    CT_INSTALL_DIR_RO=y
546[DEBUG]    CT_KERNEL=darwin
547[DEBUG]    CT_KERNEL_SUPPORTS_SHARED_LIBS=y
548[DEBUG]    CT_KERNEL_bare_metal_AVAILABLE=y
549[DEBUG]    CT_KERNEL_darwin=y
550[DEBUG]    CT_KERNEL_darwin_AVAILABLE=y
551[DEBUG]    CT_KERNEL_linux_AVAILABLE=y
552[DEBUG]    CT_KERNEL_mingw32_AVAILABLE=y
553[DEBUG]    CT_KERNEL_windows_AVAILABLE=y
554[DEBUG]    CT_LD64_VERSION=127.2
555[DEBUG]    CT_LDFLAGS_FOR_BUILD=' -m32'
556[DEBUG]    CT_LDFLAGS_FOR_HOST=' -m32'
557[DEBUG]    CT_LIBC=none
558[DEBUG]    CT_LIBC_eglibc_AVAILABLE=y
559[DEBUG]    CT_LIBC_glibc_AVAILABLE=y
560[DEBUG]    CT_LIBC_mingw_AVAILABLE=y
561[DEBUG]    CT_LIBC_newlib_AVAILABLE=y
562[DEBUG]    CT_LIBC_none=y
563[DEBUG]    CT_LIBC_none_AVAILABLE=y
564[DEBUG]    CT_LIBC_uClibc_AVAILABLE=y
565[DEBUG]    CT_LIBUUID=y
566[DEBUG]    CT_LIBUUID_E2FSPROGSLIBS=y
567[DEBUG]    CT_LIBUUID_E2FSPROGSLIBS_VERSION=1.41.14
568[DEBUG]    CT_LIBUUID_E2FSPROGSLIBS_V_1_41_14=y
569[DEBUG]    CT_LIBUUID_NEEDED=y
570[DEBUG]    CT_LIB_DIR=/usr/local/lib/ct-ng.hg+unknown-20000101.000000
571[DEBUG]    CT_LLVM=y
572[DEBUG]    CT_LLVM_FULLNAME=llvm-2.7
573[DEBUG]    CT_LLVM_NEEDED=y
574[DEBUG]    CT_LLVM_SUFFIX=
575[DEBUG]    CT_LLVM_VERSION=2.7
576[DEBUG]    CT_LLVM_V_2_7=y
577[DEBUG]    CT_LOAD=
578[DEBUG]    CT_LOCAL_TARBALLS_DIR=/home/ubuntu/src
579[DEBUG]    CT_LOG_EXTRA=y
580[DEBUG]    CT_LOG_FILE_COMPRESS=y
581[DEBUG]    CT_LOG_LEVEL_ALL=7
582[DEBUG]    CT_LOG_LEVEL_CFG=4
583[DEBUG]    CT_LOG_LEVEL_DEBUG=8
584[DEBUG]    CT_LOG_LEVEL_ERROR=0
585[DEBUG]    CT_LOG_LEVEL_EXTRA=3
586[DEBUG]    CT_LOG_LEVEL_FILE=5
587[DEBUG]    CT_LOG_LEVEL_INFO=2
588[DEBUG]    CT_LOG_LEVEL_MAX=EXTRA
589[DEBUG]    CT_LOG_LEVEL_STATE=6
590[DEBUG]    CT_LOG_LEVEL_WARN=1
591[DEBUG]    CT_LOG_PROGRESS_BAR=y
592[DEBUG]    CT_LOG_TO_FILE=y
593[DEBUG]    CT_MODULES=y
594[DEBUG]    CT_MPFR=y
595[DEBUG]    CT_MPFR_NEEDED=y
596[DEBUG]    CT_MPFR_VERSION=3.1.2
597[DEBUG]    CT_MPFR_V_3_1_2=y
598[DEBUG]    CT_MULTILIB=y
599[DEBUG]    CT_NG=/usr/local/bin/ct-ng
600[DEBUG]    CT_OPENSSL=y
601[DEBUG]    CT_OPENSSL_NEEDED=y
602[DEBUG]    CT_OPENSSL_VERSION=1.0.1e
603[DEBUG]    CT_OPENSSL_V_1_0_1_E=y
604[DEBUG]    CT_OVERIDE_CONFIG_GUESS_SUB=y
605[DEBUG]    CT_PARALLEL_JOBS=0
606[DEBUG]    CT_PATCH_BUNDLED=y
607[DEBUG]    CT_PATCH_ORDER=bundled
608[DEBUG]    CT_PKGVERSION='crosstool-NG hg+unknown-20000101.000000'
609[DEBUG]    CT_PREFIX_DIR=/home/ubuntu/x-tools/i686-apple-darwin10
610[DEBUG]    CT_REAL_BUILD=i686-pc-linux-gnu
611[DEBUG]    CT_REAL_HOST=i686-pc-linux-gnu
612[DEBUG]    CT_REAL_TARGET=i686-apple-darwin10
613[DEBUG]    CT_REMOVE_DOCS=y
614[DEBUG]    CT_RESTART=
615[DEBUG]    CT_RM_RF_PREFIX_DIR=y
616[DEBUG]    CT_SAVE_TARBALLS=
617[DEBUG]    CT_SHARED_LIBS=y
618[DEBUG]    CT_SRC_DIR=/home/ubuntu/build/crosstool-ng/ct-ng-final/.build/src
619[DEBUG]    CT_STAR_DATE=946684800287430867
620[DEBUG]    CT_STAR_DATE_HUMAN=20000101.000000
621[DEBUG]    CT_STATE_DIR=/home/ubuntu/build/crosstool-ng/ct-ng-final/.build/i686-apple-darwin10/state
622[DEBUG]    CT_STEPS='libc_check_config companion_libs_for_build binutils_for_build companion_libs_for_host binutils_for_host cc_core_pass_1 kernel_headers libc_start_files cc_core_pass_2 libc cc_for_build cc_for_host libelf_for_target binutils_for_target debug test_suite finish '
623[DEBUG]    CT_STEP_COUNT=2
624[DEBUG]    CT_STEP_LEVEL=([2]="EXTRA")
625[DEBUG]    CT_STEP_MESSAGE=([1]="(top-level)" [2]="Dumping internal crosstool-NG configuration")
626[DEBUG]    CT_STEP_START=([2]="946684800241002420")
627[DEBUG]    CT_STOP=
628[DEBUG]    CT_STRIP_ALL_TOOLCHAIN_EXECUTABLES=y
629[DEBUG]    CT_SYSROOT_DIR=/home/ubuntu/x-tools/i686-apple-darwin10/i686-apple-darwin10/sysroot
630[DEBUG]    CT_SYSROOT_DIR_PREFIX=
631[DEBUG]    CT_SYSROOT_NAME=sysroot
632[DEBUG]    CT_SYSROOT_REL_DIR=sysroot
633[DEBUG]    CT_SYS_GCC=4.6
634[DEBUG]    CT_SYS_HOSTNAME=ubuntu.defaultdomain
635[DEBUG]    CT_SYS_KERNEL=Linux
636[DEBUG]    CT_SYS_MACHINE=i686
637[DEBUG]    CT_SYS_OS=Linux
638[DEBUG]    CT_SYS_PROCESSOR=i686
639[DEBUG]    CT_SYS_REVISION=3.2.0-45-virtual
640[DEBUG]    CT_SYS_TARGET=i686-pc-linux-gnu
641[DEBUG]    CT_SYS_USER=ubuntu
642[DEBUG]    CT_TARBALLS_DIR=/home/ubuntu/build/crosstool-ng/ct-ng-final/.build/tarballs
643[DEBUG]    CT_TARGET=i686-apple-darwin10
644[DEBUG]    CT_TARGET_ALIAS=
645[DEBUG]    CT_TARGET_ALIAS_SED_EXPR=
646[DEBUG]    CT_TARGET_ARCH=i686
647[DEBUG]    CT_TARGET_CFLAGS='     -mtune=i686   '
648[DEBUG]    CT_TARGET_KERNEL=darwin10
649[DEBUG]    CT_TARGET_LDFLAGS='  '
650[DEBUG]    CT_TARGET_SYS=
651[DEBUG]    CT_TARGET_VENDOR=apple
652[DEBUG]    CT_TEST_SUITE_DIR=/home/ubuntu/x-tools/i686-apple-darwin10/test-suite
653[DEBUG]    CT_TEST_SUITE_FACILITY_LIST=
654[DEBUG]    CT_THREADS=nptl
655[DEBUG]    CT_TOOLCHAIN_BUGURL=
656[DEBUG]    CT_TOOLCHAIN_ID='crosstool-hg+unknown-20000101.000000 build 20000101.000000 by ubuntu@ubuntu.defaultdomain'
657[DEBUG]    CT_TOOLCHAIN_PKGVERSION=
658[DEBUG]    CT_TOOLCHAIN_TYPE=cross
659[DEBUG]    CT_TOOLS_OVERIDE_DIR=/home/ubuntu/build/crosstool-ng/ct-ng-final/.build/tools
660[DEBUG]    CT_TOP_DIR=/home/ubuntu/build/crosstool-ng/ct-ng-final
661[DEBUG]    CT_USE_PIPES=y
662[DEBUG]    CT_USE_SYSROOT=y
663[DEBUG]    CT_VERSION=hg+unknown-20000101.000000
664[DEBUG]    CT_WORK_DIR=/home/ubuntu/build/crosstool-ng/ct-ng-final/.build
665[DEBUG]    Other environment:
666[DEBUG]    AS=i686-build_pc-linux-gnu-as
667[DEBUG]    grep=/bin/grep
668[DEBUG]    AR=i686-build_pc-linux-gnu-ar
669[DEBUG]    SHELL=/bin/bash
670[DEBUG]    NM=i686-build_pc-linux-gnu-nm
671[DEBUG]    SSH_CLIENT=10.0.2.2 57388 22
672[DEBUG]    LD_PRELOAD=/usr/lib/faketime/libfaketime.so.1
673[DEBUG]    patch=/usr/bin/patch
674[DEBUG]    bash=/bin/bash
675[DEBUG]    libtoolize=/usr/bin/libtoolize
676[DEBUG]    OLDPWD=/home/ubuntu/x-tools/i686-apple-darwin10/i686-apple-darwin10
677[DEBUG]    objcopy=/usr/bin/objcopy
678[DEBUG]    LC_ALL=C
679[DEBUG]    USER=ubuntu
680[DEBUG]    install=/usr/bin/install -c
681[DEBUG]    V=
682[DEBUG]    CONFIG_SITE=
683[DEBUG]    MAKELEVEL=1
684[DEBUG]    OUTDIR=/home/ubuntu/out
685[DEBUG]    MFLAGS=- --no-print-directory -r
686[DEBUG]    readelf=/usr/bin/readelf
687[DEBUG]    ECHO=echo
688[DEBUG]    KCONFIG_TOP=config/config.in
689[DEBUG]    PATH=/home/ubuntu/x-tools/i686-apple-darwin10/bin:/home/ubuntu/build/crosstool-ng/ct-ng-final/.build/i686-apple-darwin10/buildtools/bin:/home/ubuntu/build/crosstool-ng/ct-ng-final/.build/tools/bin:/usr/local/sbin:/usr/local/bin:/usr/sbin:/usr/bin:/sbin:/bin:/usr/games:/usr/apple-osx/bin/:/usr/local/ct-ng-build
690[DEBUG]    objdump=/usr/bin/objdump
691[DEBUG]    MAIL=/var/mail/ubuntu
692[DEBUG]    LD=i686-build_pc-linux-gnu-ld
693[DEBUG]    sed=/bin/sed
694[DEBUG]    PWD=/home/ubuntu/build/crosstool-ng/ct-ng-final
695[DEBUG]    STRIP=i686-build_pc-linux-gnu-strip
696[DEBUG]    gperf=/usr/bin/gperf
697[DEBUG]    CONF=/usr/local/lib/ct-ng.hg+unknown-20000101.000000/kconfig/conf
698[DEBUG]    LANG=C
699[DEBUG]    TZ=UTC
700[DEBUG]    awk=/usr/bin/awk
701[DEBUG]    CXX=i686-build_pc-linux-gnu-g++
702[DEBUG]    OBJCOPY=i686-build_pc-linux-gnu-objcopy
703[DEBUG]    CONFIG_SHELL=/bin/bash
704[DEBUG]    HOME=/home/ubuntu
705[DEBUG]    SHLVL=4
706[DEBUG]    make=/usr/bin/make
707[DEBUG]    GREP_OPTIONS=
708[DEBUG]    FAKETIME=2000-01-01 00:00:00
709[DEBUG]    libtool=/usr/bin/libtool
710[DEBUG]    SILENT=@
711[DEBUG]    LOGNAME=ubuntu
712[DEBUG]    SSH_CONNECTION=10.0.2.2 57388 10.0.2.15 22
713[DEBUG]    RANLIB=i686-build_pc-linux-gnu-ranlib
714[DEBUG]    CC=i686-build_pc-linux-gnu-gcc
715[DEBUG]    OBJDUMP=i686-build_pc-linux-gnu-objdump
716[DEBUG]    _=/usr/bin/printenv
717[EXTRA]  Dumping internal crosstool-NG configuration: done in 0.20s (at 00:00)
718
719[snip...]
720
721[ALL  ]    llvm[2]: Packaging HTML documentation
722[ALL  ]    llvm[2]: Installing HTML documentation
723[ALL  ]    make[3]: Entering directory `/home/ubuntu/build/crosstool-ng/ct-ng-final/.build/i686-apple-darwin10/build/build-LLVM-host-i686-build_pc-linux-gnu/docs/CommandGuide'
724[ALL  ]    make[3]: Warning: File `../../Makefile.config' has modification time 0.18 s in the future
725[ALL  ]    pod2html --css=manpage.css --htmlroot=.        --podpath=. --noindex --infile=FileCheck.pod --outfile=/home/ubuntu/build/crosstool-ng/ct-ng-final/.build/i686-apple-darwin10/build/build-LLVM-host-i686-build_pc-linux-gnu/docs/CommandGuide/FileCheck.html --title=FileCheck
726[ALL  ]    pod2html --css=manpage.css --htmlroot=.        --podpath=. --noindex --infile=bugpoint.pod --outfile=/home/ubuntu/build/crosstool-ng/ct-ng-final/.build/i686-apple-darwin10/build/build-LLVM-host-i686-build_pc-linux-gnu/docs/CommandGuide/bugpoint.html --title=bugpoint
727[ALL  ]    pod2html --css=manpage.css --htmlroot=.        --podpath=. --noindex --infile=lit.pod --outfile=/home/ubuntu/build/crosstool-ng/ct-ng-final/.build/i686-apple-darwin10/build/build-LLVM-host-i686-build_pc-linux-gnu/docs/CommandGuide/lit.html --title=lit
728[ALL  ]    /usr/bin/pod2html: lit.pod: cannot resolve L<valgrind(1)> in paragraph 122.
729[ALL  ]    pod2html --css=manpage.css --htmlroot=.        --podpath=. --noindex --infile=llc.pod --outfile=/home/ubuntu/build/crosstool-ng/ct-ng-final/.build/i686-apple-darwin10/build/build-LLVM-host-i686-build_pc-linux-gnu/docs/CommandGuide/llc.html --title=llc
730[ALL  ]    pod2html --css=manpage.css --htmlroot=.        --podpath=. --noindex --infile=lli.pod --outfile=/home/ubuntu/build/crosstool-ng/ct-ng-final/.build/i686-apple-darwin10/build/build-LLVM-host-i686-build_pc-linux-gnu/docs/CommandGuide/lli.html --title=lli
731[ALL  ]    pod2html --css=manpage.css --htmlroot=.        --podpath=. --noindex --infile=llvm-ar.pod --outfile=/home/ubuntu/build/crosstool-ng/ct-ng-final/.build/i686-apple-darwin10/build/build-LLVM-host-i686-build_pc-linux-gnu/docs/CommandGuide/llvm-ar.html --title=llvm-ar
732[ALL  ]    pod2html --css=manpage.css --htmlroot=.        --podpath=. --noindex --infile=llvm-as.pod --outfile=/home/ubuntu/build/crosstool-ng/ct-ng-final/.build/i686-apple-darwin10/build/build-LLVM-host-i686-build_pc-linux-gnu/docs/CommandGuide/llvm-as.html --title=llvm-as
733[ALL  ]    /usr/bin/pod2html: llvm-as.pod: cannot resolve L<gccas|gccas> in paragraph 30.
734[ALL  ]    pod2html --css=manpage.css --htmlroot=.        --podpath=. --noindex --infile=llvm-bcanalyzer.pod --outfile=/home/ubuntu/build/crosstool-ng/ct-ng-final/.build/i686-apple-darwin10/build/build-LLVM-host-i686-build_pc-linux-gnu/docs/CommandGuide/llvm-bcanalyzer.html --title=llvm-bcanalyzer
735[ALL  ]    pod2html --css=manpage.css --htmlroot=.        --podpath=. --noindex --infile=llvm-config.pod --outfile=/home/ubuntu/build/crosstool-ng/ct-ng-final/.build/i686-apple-darwin10/build/build-LLVM-host-i686-build_pc-linux-gnu/docs/CommandGuide/llvm-config.html --title=llvm-config
736[ALL  ]    pod2html --css=manpage.css --htmlroot=.        --podpath=. --noindex --infile=llvm-dis.pod --outfile=/home/ubuntu/build/crosstool-ng/ct-ng-final/.build/i686-apple-darwin10/build/build-LLVM-host-i686-build_pc-linux-gnu/docs/CommandGuide/llvm-dis.html --title=llvm-dis
737[ALL  ]    pod2html --css=manpage.css --htmlroot=.        --podpath=. --noindex --infile=llvm-extract.pod --outfile=/home/ubuntu/build/crosstool-ng/ct-ng-final/.build/i686-apple-darwin10/build/build-LLVM-host-i686-build_pc-linux-gnu/docs/CommandGuide/llvm-extract.html --title=llvm-extract
738[ALL  ]    pod2html --css=manpage.css --htmlroot=.        --podpath=. --noindex --infile=llvm-ld.pod --outfile=/home/ubuntu/build/crosstool-ng/ct-ng-final/.build/i686-apple-darwin10/build/build-LLVM-host-i686-build_pc-linux-gnu/docs/CommandGuide/llvm-ld.html --title=llvm-ld
739[ALL  ]    pod2html --css=manpage.css --htmlroot=.        --podpath=. --noindex --infile=llvm-link.pod --outfile=/home/ubuntu/build/crosstool-ng/ct-ng-final/.build/i686-apple-darwin10/build/build-LLVM-host-i686-build_pc-linux-gnu/docs/CommandGuide/llvm-link.html --title=llvm-link
740[ALL  ]    /usr/bin/pod2html: llvm-link.pod: cannot resolve L<gccld|gccld> in paragraph 29.
741[ALL  ]    pod2html --css=manpage.css --htmlroot=.        --podpath=. --noindex --infile=llvm-nm.pod --outfile=/home/ubuntu/build/crosstool-ng/ct-ng-final/.build/i686-apple-darwin10/build/build-LLVM-host-i686-build_pc-linux-gnu/docs/CommandGuide/llvm-nm.html --title=llvm-nm
742[ALL  ]    pod2html --css=manpage.css --htmlroot=.        --podpath=. --noindex --infile=llvm-prof.pod --outfile=/home/ubuntu/build/crosstool-ng/ct-ng-final/.build/i686-apple-darwin10/build/build-LLVM-host-i686-build_pc-linux-gnu/docs/CommandGuide/llvm-prof.html --title=llvm-prof
743[ALL  ]    pod2html --css=manpage.css --htmlroot=.        --podpath=. --noindex --infile=llvm-ranlib.pod --outfile=/home/ubuntu/build/crosstool-ng/ct-ng-final/.build/i686-apple-darwin10/build/build-LLVM-host-i686-build_pc-linux-gnu/docs/CommandGuide/llvm-ranlib.html --title=llvm-ranlib
744[ALL  ]    pod2html --css=manpage.css --htmlroot=.        --podpath=. --noindex --infile=llvmc.pod --outfile=/home/ubuntu/build/crosstool-ng/ct-ng-final/.build/i686-apple-darwin10/build/build-LLVM-host-i686-build_pc-linux-gnu/docs/CommandGuide/llvmc.html --title=llvmc
745[ALL  ]    pod2html --css=manpage.css --htmlroot=.        --podpath=. --noindex --infile=llvmgcc.pod --outfile=/home/ubuntu/build/crosstool-ng/ct-ng-final/.build/i686-apple-darwin10/build/build-LLVM-host-i686-build_pc-linux-gnu/docs/CommandGuide/llvmgcc.html --title=llvmgcc
746[ALL  ]    pod2html --css=manpage.css --htmlroot=.        --podpath=. --noindex --infile=llvmgxx.pod --outfile=/home/ubuntu/build/crosstool-ng/ct-ng-final/.build/i686-apple-darwin10/build/build-LLVM-host-i686-build_pc-linux-gnu/docs/CommandGuide/llvmgxx.html --title=llvmgxx
747[ALL  ]    pod2html --css=manpage.css --htmlroot=.        --podpath=. --noindex --infile=opt.pod --outfile=/home/ubuntu/build/crosstool-ng/ct-ng-final/.build/i686-apple-darwin10/build/build-LLVM-host-i686-build_pc-linux-gnu/docs/CommandGuide/opt.html --title=opt
748[ALL  ]    pod2html --css=manpage.css --htmlroot=.        --podpath=. --noindex --infile=tblgen.pod --outfile=/home/ubuntu/build/crosstool-ng/ct-ng-final/.build/i686-apple-darwin10/build/build-LLVM-host-i686-build_pc-linux-gnu/docs/CommandGuide/tblgen.html --title=tblgen
749[ALL  ]    pod2man --release=CVS --center="LLVM Command Guide" bugpoint.pod /home/ubuntu/build/crosstool-ng/ct-ng-final/.build/i686-apple-darwin10/build/build-LLVM-host-i686-build_pc-linux-gnu/docs/CommandGuide/bugpoint.1
750[ALL  ]    pod2man --release=CVS --center="LLVM Command Guide" lit.pod /home/ubuntu/build/crosstool-ng/ct-ng-final/.build/i686-apple-darwin10/build/build-LLVM-host-i686-build_pc-linux-gnu/docs/CommandGuide/lit.1
751[ALL  ]    pod2man --release=CVS --center="LLVM Command Guide" llc.pod /home/ubuntu/build/crosstool-ng/ct-ng-final/.build/i686-apple-darwin10/build/build-LLVM-host-i686-build_pc-linux-gnu/docs/CommandGuide/llc.1
752[ALL  ]    pod2man --release=CVS --center="LLVM Command Guide" lli.pod /home/ubuntu/build/crosstool-ng/ct-ng-final/.build/i686-apple-darwin10/build/build-LLVM-host-i686-build_pc-linux-gnu/docs/CommandGuide/lli.1
753[ALL  ]    pod2man --release=CVS --center="LLVM Command Guide" llvm-ar.pod /home/ubuntu/build/crosstool-ng/ct-ng-final/.build/i686-apple-darwin10/build/build-LLVM-host-i686-build_pc-linux-gnu/docs/CommandGuide/llvm-ar.1
754[ALL  ]    pod2man --release=CVS --center="LLVM Command Guide" llvm-as.pod /home/ubuntu/build/crosstool-ng/ct-ng-final/.build/i686-apple-darwin10/build/build-LLVM-host-i686-build_pc-linux-gnu/docs/CommandGuide/llvm-as.1
755[ALL  ]    pod2man --release=CVS --center="LLVM Command Guide" llvm-bcanalyzer.pod /home/ubuntu/build/crosstool-ng/ct-ng-final/.build/i686-apple-darwin10/build/build-LLVM-host-i686-build_pc-linux-gnu/docs/CommandGuide/llvm-bcanalyzer.1
756[ALL  ]    pod2man --release=CVS --center="LLVM Command Guide" llvm-config.pod /home/ubuntu/build/crosstool-ng/ct-ng-final/.build/i686-apple-darwin10/build/build-LLVM-host-i686-build_pc-linux-gnu/docs/CommandGuide/llvm-config.1
757[ALL  ]    pod2man --release=CVS --center="LLVM Command Guide" llvm-dis.pod /home/ubuntu/build/crosstool-ng/ct-ng-final/.build/i686-apple-darwin10/build/build-LLVM-host-i686-build_pc-linux-gnu/docs/CommandGuide/llvm-dis.1
758[ALL  ]    pod2man --release=CVS --center="LLVM Command Guide" llvm-extract.pod /home/ubuntu/build/crosstool-ng/ct-ng-final/.build/i686-apple-darwin10/build/build-LLVM-host-i686-build_pc-linux-gnu/docs/CommandGuide/llvm-extract.1
759[ALL  ]    pod2man --release=CVS --center="LLVM Command Guide" llvm-ld.pod /home/ubuntu/build/crosstool-ng/ct-ng-final/.build/i686-apple-darwin10/build/build-LLVM-host-i686-build_pc-linux-gnu/docs/CommandGuide/llvm-ld.1
760[ALL  ]    pod2man --release=CVS --center="LLVM Command Guide" llvm-link.pod /home/ubuntu/build/crosstool-ng/ct-ng-final/.build/i686-apple-darwin10/build/build-LLVM-host-i686-build_pc-linux-gnu/docs/CommandGuide/llvm-link.1
761[ALL  ]    pod2man --release=CVS --center="LLVM Command Guide" llvm-nm.pod /home/ubuntu/build/crosstool-ng/ct-ng-final/.build/i686-apple-darwin10/build/build-LLVM-host-i686-build_pc-linux-gnu/docs/CommandGuide/llvm-nm.1
762[ALL  ]    pod2man --release=CVS --center="LLVM Command Guide" llvm-prof.pod /home/ubuntu/build/crosstool-ng/ct-ng-final/.build/i686-apple-darwin10/build/build-LLVM-host-i686-build_pc-linux-gnu/docs/CommandGuide/llvm-prof.1
763[ALL  ]    pod2man --release=CVS --center="LLVM Command Guide" llvm-ranlib.pod /home/ubuntu/build/crosstool-ng/ct-ng-final/.build/i686-apple-darwin10/build/build-LLVM-host-i686-build_pc-linux-gnu/docs/CommandGuide/llvm-ranlib.1
764[ALL  ]    pod2man --release=CVS --center="LLVM Command Guide" llvmc.pod /home/ubuntu/build/crosstool-ng/ct-ng-final/.build/i686-apple-darwin10/build/build-LLVM-host-i686-build_pc-linux-gnu/docs/CommandGuide/llvmc.1
765[ALL  ]    pod2man --release=CVS --center="LLVM Command Guide" llvmgcc.pod /home/ubuntu/build/crosstool-ng/ct-ng-final/.build/i686-apple-darwin10/build/build-LLVM-host-i686-build_pc-linux-gnu/docs/CommandGuide/llvmgcc.1
766[ALL  ]    pod2man --release=CVS --center="LLVM Command Guide" llvmgxx.pod /home/ubuntu/build/crosstool-ng/ct-ng-final/.build/i686-apple-darwin10/build/build-LLVM-host-i686-build_pc-linux-gnu/docs/CommandGuide/llvmgxx.1
767[ALL  ]    pod2man --release=CVS --center="LLVM Command Guide" opt.pod /home/ubuntu/build/crosstool-ng/ct-ng-final/.build/i686-apple-darwin10/build/build-LLVM-host-i686-build_pc-linux-gnu/docs/CommandGuide/opt.1
768[ALL  ]    pod2man --release=CVS --center="LLVM Command Guide" tblgen.pod /home/ubuntu/build/crosstool-ng/ct-ng-final/.build/i686-apple-darwin10/build/build-LLVM-host-i686-build_pc-linux-gnu/docs/CommandGuide/tblgen.1
769[ALL  ]    pod2man --release=CVS --center="LLVM Command Guide" FileCheck.pod /home/ubuntu/build/crosstool-ng/ct-ng-final/.build/i686-apple-darwin10/build/build-LLVM-host-i686-build_pc-linux-gnu/docs/CommandGuide/FileCheck.1
770[ALL  ]    groff -Tps -man /home/ubuntu/build/crosstool-ng/ct-ng-final/.build/i686-apple-darwin10/build/build-LLVM-host-i686-build_pc-linux-gnu/docs/CommandGuide/FileCheck.1 > /home/ubuntu/build/crosstool-ng/ct-ng-final/.build/i686-apple-darwin10/build/build-LLVM-host-i686-build_pc-linux-gnu/docs/CommandGuide/FileCheck.ps
771[ALL  ]    /bin/sh: 1: groff: not found
772[ERROR]    make[3]: *** [/home/ubuntu/build/crosstool-ng/ct-ng-final/.build/i686-apple-darwin10/build/build-LLVM-host-i686-build_pc-linux-gnu/docs/CommandGuide/FileCheck.ps] Error 127
773[ALL  ]    rm /home/ubuntu/build/crosstool-ng/ct-ng-final/.build/i686-apple-darwin10/build/build-LLVM-host-i686-build_pc-linux-gnu/docs/CommandGuide//.dir
774[ALL  ]    make[3]: Leaving directory `/home/ubuntu/build/crosstool-ng/ct-ng-final/.build/i686-apple-darwin10/build/build-LLVM-host-i686-build_pc-linux-gnu/docs/CommandGuide'
775[ERROR]    make[2]: *** [install] Error 1
776[ALL  ]    make[2]: Leaving directory `/home/ubuntu/build/crosstool-ng/ct-ng-final/.build/i686-apple-darwin10/build/build-LLVM-host-i686-build_pc-linux-gnu/docs'
777[ERROR]    make[1]: *** [install] Error 1
778[ALL  ]    make[1]: Leaving directory `/home/ubuntu/build/crosstool-ng/ct-ng-final/.build/i686-apple-darwin10/build/build-LLVM-host-i686-build_pc-linux-gnu'
779[ERROR] 
780[ERROR]  >>
781[ERROR]  >>  Build failed in step 'Installing LLVM for host'
782[ERROR]  >>        called in step '(top-level)'
783[ERROR]  >>
784[ERROR]  >>  Error happened in: CT_DoExecLog[scripts/functions@257]
785[ERROR]  >>        called from: do_llvm_backend[scripts/build/companion_libs/150-llvm.sh@134]
786[ERROR]  >>        called from: do_llvm_for_host[scripts/build/companion_libs/150-llvm.sh@85]
787[ERROR]  >>        called from: do_companion_libs_for_host[scripts/build/companion_libs.sh@36]
788[ERROR]  >>        called from: main[scripts/crosstool-NG.sh@651]
789[ERROR]  >>
790[ERROR]  >>  For more info on this error, look at the file: 'build.log'
791[ERROR]  >>  There is a list of known issues, some with workarounds, in:
792[ERROR]  >>      '/usr/local/share/doc/crosstool-ng/ct-ng.hg+unknown-20000101.000000/B - Known issues.txt'
793[ERROR] 
794[ERROR]  (elapsed: 0:00.36)