Ticket #9711: cross_mac_build2

File cross_mac_build2, 86.0 KB (added by gk, 6 years ago)
Line 
1[INFO ]  Performing some trivial sanity checks
2[DEBUG]  Testing '! ( -n  )'
3[DEBUG]  Testing '! ( -n  )'
4[DEBUG]  Testing '! ( -n  )'
5[DEBUG]  Testing '! ( -n  )'
6[DEBUG]  Testing '! ( -n  )'
7[DEBUG]  Testing '! ( -n  )'
8[DEBUG]  ==> Executing: 'mkdir' '-p' '/home/ubuntu/build/crosstool-ng/ct-ng-final/.build'
9[DEBUG]  ==> Executing: 'rm' '-f' '/home/ubuntu/build/crosstool-ng/ct-ng-final/.build/backtrace'
10[DEBUG]  ==> Executing: 'touch' '/home/ubuntu/build/crosstool-ng/ct-ng-final/.build/foo'
11[DEBUG]  Testing '! ( -f /home/ubuntu/build/crosstool-ng/ct-ng-final/.build/FOO )'
12[DEBUG]  ==> Executing: 'rm' '-f' '/home/ubuntu/build/crosstool-ng/ct-ng-final/.build/foo'
13[DEBUG]  Testing '-f /bin/bash -a -x /bin/bash'
14[DEBUG]  Creating bin-override for tools in '/home/ubuntu/build/crosstool-ng/ct-ng-final/.build/tools'
15[DEBUG]  ==> Executing: 'mkdir' '-p' '/home/ubuntu/build/crosstool-ng/ct-ng-final/.build/tools/bin'
16[DEBUG]  Creating script-override for 'install' -> '"/usr/bin/install -c"'
17[DEBUG]  ==> Executing: 'chmod' '700' '/home/ubuntu/build/crosstool-ng/ct-ng-final/.build/tools/bin/install'
18[DEBUG]  Creating script-override for 'bash' -> '"/bin/bash"'
19[DEBUG]  ==> Executing: 'chmod' '700' '/home/ubuntu/build/crosstool-ng/ct-ng-final/.build/tools/bin/bash'
20[DEBUG]  Creating script-override for 'awk' -> '"/usr/bin/awk"'
21[DEBUG]  ==> Executing: 'chmod' '700' '/home/ubuntu/build/crosstool-ng/ct-ng-final/.build/tools/bin/awk'
22[DEBUG]  Creating script-override for 'grep' -> '"/bin/grep"'
23[DEBUG]  ==> Executing: 'chmod' '700' '/home/ubuntu/build/crosstool-ng/ct-ng-final/.build/tools/bin/grep'
24[DEBUG]  Creating script-override for 'make' -> '"/usr/bin/make"'
25[DEBUG]  ==> Executing: 'chmod' '700' '/home/ubuntu/build/crosstool-ng/ct-ng-final/.build/tools/bin/make'
26[DEBUG]  Creating script-override for 'sed' -> '"/bin/sed"'
27[DEBUG]  ==> Executing: 'chmod' '700' '/home/ubuntu/build/crosstool-ng/ct-ng-final/.build/tools/bin/sed'
28[DEBUG]  Creating script-override for 'libtool' -> '"/usr/bin/libtool"'
29[DEBUG]  ==> Executing: 'chmod' '700' '/home/ubuntu/build/crosstool-ng/ct-ng-final/.build/tools/bin/libtool'
30[DEBUG]  Creating script-override for 'libtoolize' -> '"/usr/bin/libtoolize"'
31[DEBUG]  ==> Executing: 'chmod' '700' '/home/ubuntu/build/crosstool-ng/ct-ng-final/.build/tools/bin/libtoolize'
32[DEBUG]  Creating script-override for 'objcopy' -> '"/usr/bin/objcopy"'
33[DEBUG]  ==> Executing: 'chmod' '700' '/home/ubuntu/build/crosstool-ng/ct-ng-final/.build/tools/bin/objcopy'
34[DEBUG]  Creating script-override for 'objdump' -> '"/usr/bin/objdump"'
35[DEBUG]  ==> Executing: 'chmod' '700' '/home/ubuntu/build/crosstool-ng/ct-ng-final/.build/tools/bin/objdump'
36[DEBUG]  Creating script-override for 'readelf' -> '"/usr/bin/readelf"'
37[DEBUG]  ==> Executing: 'chmod' '700' '/home/ubuntu/build/crosstool-ng/ct-ng-final/.build/tools/bin/readelf'
38[DEBUG]  Creating script-override for 'patch' -> '"/usr/bin/patch"'
39[DEBUG]  ==> Executing: 'chmod' '700' '/home/ubuntu/build/crosstool-ng/ct-ng-final/.build/tools/bin/patch'
40[DEBUG]  Creating script-override for 'gperf' -> '"/usr/bin/gperf"'
41[DEBUG]  ==> Executing: 'chmod' '700' '/home/ubuntu/build/crosstool-ng/ct-ng-final/.build/tools/bin/gperf'
42[INFO ]  Build started 20000101.000000
43[DEBUG]  =================================================================
44[DEBUG]  Dumping user-supplied crosstool-NG configuration
45[DEBUG]    ==> Executing: 'grep' '-E' '^(# |)CT_' '.config'
46[DEBUG]    CT_CONFIGURE_has_xz=y
47[DEBUG]    CT_CONFIGURE_has_svn=y
48[DEBUG]    CT_MODULES=y
49[DEBUG]    # CT_OBSOLETE is not set
50[DEBUG]    CT_EXPERIMENTAL=y
51[DEBUG]    # CT_ALLOW_BUILD_AS_ROOT is not set
52[DEBUG]    # CT_EXPORT_BUILD_TOOLS is not set
53[DEBUG]    # CT_DEBUG_CT is not set
54[DEBUG]    CT_LOCAL_TARBALLS_DIR="${HOME}/src"
55[DEBUG]    CT_SAVE_TARBALLS=y
56[DEBUG]    CT_CUSTOM_LOCATION_ROOT_DIR=""
57[DEBUG]    CT_WORK_DIR="${CT_TOP_DIR}/.build"
58[DEBUG]    CT_PREFIX_DIR="${HOME}/x-tools/${CT_TARGET}"
59[DEBUG]    CT_INSTALL_DIR="${CT_PREFIX_DIR}"
60[DEBUG]    CT_RM_RF_PREFIX_DIR=y
61[DEBUG]    CT_REMOVE_DOCS=y
62[DEBUG]    CT_INSTALL_DIR_RO=y
63[DEBUG]    CT_STRIP_ALL_TOOLCHAIN_EXECUTABLES=y
64[DEBUG]    # CT_FORBID_DOWNLOAD is not set
65[DEBUG]    # CT_FORCE_DOWNLOAD is not set
66[DEBUG]    CT_CONNECT_TIMEOUT=10
67[DEBUG]    # CT_ONLY_DOWNLOAD is not set
68[DEBUG]    # CT_USE_MIRROR is not set
69[DEBUG]    # CT_FORCE_EXTRACT is not set
70[DEBUG]    CT_OVERIDE_CONFIG_GUESS_SUB=y
71[DEBUG]    # CT_ONLY_EXTRACT is not set
72[DEBUG]    CT_PATCH_BUNDLED=y
73[DEBUG]    # CT_PATCH_LOCAL is not set
74[DEBUG]    # CT_PATCH_BUNDLED_LOCAL is not set
75[DEBUG]    # CT_PATCH_LOCAL_BUNDLED is not set
76[DEBUG]    # CT_PATCH_BUNDLED_FALLBACK_LOCAL is not set
77[DEBUG]    # CT_PATCH_LOCAL_FALLBACK_BUNDLED is not set
78[DEBUG]    # CT_PATCH_NONE is not set
79[DEBUG]    CT_PATCH_ORDER="bundled"
80[DEBUG]    CT_PARALLEL_JOBS=0
81[DEBUG]    CT_LOAD=""
82[DEBUG]    CT_USE_PIPES=y
83[DEBUG]    CT_EXTRA_CFLAGS_FOR_BUILD="-m32"
84[DEBUG]    CT_EXTRA_LDFLAGS_FOR_BUILD="-m32"
85[DEBUG]    CT_EXTRA_CFLAGS_FOR_HOST="-m32"
86[DEBUG]    CT_EXTRA_LDFLAGS_FOR_HOST="-m32"
87[DEBUG]    # CT_CONFIG_SHELL_SH is not set
88[DEBUG]    # CT_CONFIG_SHELL_ASH is not set
89[DEBUG]    CT_CONFIG_SHELL_BASH=y
90[DEBUG]    # CT_CONFIG_SHELL_CUSTOM is not set
91[DEBUG]    CT_CONFIG_SHELL="${bash}"
92[DEBUG]    # CT_LOG_ERROR is not set
93[DEBUG]    # CT_LOG_WARN is not set
94[DEBUG]    # CT_LOG_INFO is not set
95[DEBUG]    CT_LOG_EXTRA=y
96[DEBUG]    # CT_LOG_ALL is not set
97[DEBUG]    # CT_LOG_DEBUG is not set
98[DEBUG]    CT_LOG_LEVEL_MAX="EXTRA"
99[DEBUG]    # CT_LOG_SEE_TOOLS_WARN is not set
100[DEBUG]    CT_LOG_PROGRESS_BAR=y
101[DEBUG]    CT_LOG_TO_FILE=y
102[DEBUG]    CT_LOG_FILE_COMPRESS=y
103[DEBUG]    CT_ARCH="x86"
104[DEBUG]    CT_ARCH_SUPPORTS_32=y
105[DEBUG]    CT_ARCH_SUPPORTS_64=y
106[DEBUG]    CT_ARCH_SUPPORTS_WITH_ARCH=y
107[DEBUG]    CT_ARCH_SUPPORTS_WITH_CPU=y
108[DEBUG]    CT_ARCH_SUPPORTS_WITH_TUNE=y
109[DEBUG]    CT_ARCH_DEFAULT_32=y
110[DEBUG]    CT_ARCH_ARCH=""
111[DEBUG]    CT_ARCH_CPU=""
112[DEBUG]    CT_ARCH_TUNE="i686"
113[DEBUG]    CT_ARCH_32=y
114[DEBUG]    # CT_ARCH_64 is not set
115[DEBUG]    CT_ARCH_BITNESS=32
116[DEBUG]    CT_TARGET_CFLAGS=""
117[DEBUG]    CT_TARGET_LDFLAGS=""
118[DEBUG]    # CT_ARCH_alpha is not set
119[DEBUG]    # CT_ARCH_arm is not set
120[DEBUG]    # CT_ARCH_avr32 is not set
121[DEBUG]    # CT_ARCH_blackfin is not set
122[DEBUG]    # CT_ARCH_m68k is not set
123[DEBUG]    # CT_ARCH_microblaze is not set
124[DEBUG]    # CT_ARCH_mips is not set
125[DEBUG]    # CT_ARCH_powerpc is not set
126[DEBUG]    # CT_ARCH_s390 is not set
127[DEBUG]    # CT_ARCH_sh is not set
128[DEBUG]    # CT_ARCH_sparc is not set
129[DEBUG]    CT_ARCH_x86=y
130[DEBUG]    CT_ARCH_alpha_AVAILABLE=y
131[DEBUG]    CT_ARCH_arm_AVAILABLE=y
132[DEBUG]    CT_ARCH_avr32_AVAILABLE=y
133[DEBUG]    CT_ARCH_blackfin_AVAILABLE=y
134[DEBUG]    CT_ARCH_m68k_AVAILABLE=y
135[DEBUG]    CT_ARCH_microblaze_AVAILABLE=y
136[DEBUG]    CT_ARCH_mips_AVAILABLE=y
137[DEBUG]    CT_ARCH_powerpc_AVAILABLE=y
138[DEBUG]    CT_ARCH_s390_AVAILABLE=y
139[DEBUG]    CT_ARCH_sh_AVAILABLE=y
140[DEBUG]    CT_ARCH_sparc_AVAILABLE=y
141[DEBUG]    CT_ARCH_x86_AVAILABLE=y
142[DEBUG]    CT_ARCH_SUFFIX=""
143[DEBUG]    CT_MULTILIB=y
144[DEBUG]    CT_ARCH_USE_MMU=y
145[DEBUG]    CT_ARCH_FLOAT=""
146[DEBUG]    CT_FORCE_SYSROOT=y
147[DEBUG]    CT_USE_SYSROOT=y
148[DEBUG]    CT_SYSROOT_NAME="sysroot"
149[DEBUG]    CT_SYSROOT_DIR_PREFIX=""
150[DEBUG]    # CT_STATIC_TOOLCHAIN is not set
151[DEBUG]    # CT_DEBUGGABLE_TOOLCHAIN is not set
152[DEBUG]    CT_TOOLCHAIN_PKGVERSION=""
153[DEBUG]    CT_TOOLCHAIN_BUGURL=""
154[DEBUG]    CT_TARGET_VENDOR="apple"
155[DEBUG]    CT_TARGET_ALIAS_SED_EXPR=""
156[DEBUG]    CT_TARGET_ALIAS=""
157[DEBUG]    # CT_NATIVE is not set
158[DEBUG]    CT_CROSS=y
159[DEBUG]    # CT_CROSS_NATIVE is not set
160[DEBUG]    # CT_CANADIAN is not set
161[DEBUG]    CT_TOOLCHAIN_TYPE="cross"
162[DEBUG]    CT_BUILD=""
163[DEBUG]    CT_BUILD_PREFIX=""
164[DEBUG]    CT_BUILD_SUFFIX=""
165[DEBUG]    # CT_TOOLCHAIN_ENABLE_NLS is not set
166[DEBUG]    # CT_DARWIN_COPY_SDK_TO_SYSROOT is not set
167[DEBUG]    CT_DARWIN=y
168[DEBUG]    CT_KERNEL_SUPPORTS_SHARED_LIBS=y
169[DEBUG]    CT_KERNEL="darwin"
170[DEBUG]    # CT_KERNEL_bare_metal is not set
171[DEBUG]    CT_KERNEL_darwin=y
172[DEBUG]    # CT_KERNEL_linux is not set
173[DEBUG]    # CT_KERNEL_windows is not set
174[DEBUG]    CT_KERNEL_bare_metal_AVAILABLE=y
175[DEBUG]    CT_KERNEL_darwin_AVAILABLE=y
176[DEBUG]    # CT_DARWIN_MAC_OSX_V_10_7 is not set
177[DEBUG]    CT_DARWIN_MAC_OSX_V_10_6=y
178[DEBUG]    # CT_DARWIN_IOS_V_5_0 is not set
179[DEBUG]    # CT_DARWIN_IOS_V_6_0 is not set
180[DEBUG]    # CT_DARWIN_IOS_V_6_1 is not set
181[DEBUG]    CT_DARWIN_VERSION="10"
182[DEBUG]    CT_DARWIN_SDK_PATH="${HOME}/MacOSX10.6.sdk"
183[DEBUG]    CT_DARWIN_SDK="MacOSX10.6.sdk"
184[DEBUG]    CT_KERNEL_linux_AVAILABLE=y
185[DEBUG]    CT_KERNEL_windows_AVAILABLE=y
186[DEBUG]    CT_SHARED_LIBS=y
187[DEBUG]    CT_ARCH_BINFMT_MACH_O=y
188[DEBUG]    CT_BINUTILS="cctools"
189[DEBUG]    CT_BINUTILS_cctools=y
190[DEBUG]    CT_BINUTILS_VERSION="809"
191[DEBUG]    CT_CCTOOLS_V_809=y
192[DEBUG]    # CT_CCTOOLS_V_806 is not set
193[DEBUG]    CT_CC_clang=y
194[DEBUG]    CT_CC_CLANG_V_2_7=y
195[DEBUG]    CT_CC_CLANG_VERSION="2.7"
196[DEBUG]    CT_CC_gcc=y
197[DEBUG]    CT_CC_GCC_V_apple_5666_3=y
198[DEBUG]    CT_CC_GCC_APPLE=y
199[DEBUG]    # CT_CC_GCC_USE_GRAPHITE is not set
200[DEBUG]    # CT_CC_GCC_USE_LTO is not set
201[DEBUG]    CT_CC_GCC_VERSION="5666.3"
202[DEBUG]    # CT_CC_LANG_FORTRAN is not set
203[DEBUG]    CT_CC_GCC_ENABLE_CXX_FLAGS=""
204[DEBUG]    CT_CC_GCC_CORE_EXTRA_CONFIG_ARRAY=""
205[DEBUG]    CT_CC_GCC_EXTRA_CONFIG_ARRAY=""
206[DEBUG]    # CT_CC_GCC_SYSTEM_ZLIB is not set
207[DEBUG]    CT_CC_GCC_ENABLE_TARGET_OPTSPACE=y
208[DEBUG]    # CT_CC_GCC_LIBMUDFLAP is not set
209[DEBUG]    # CT_CC_GCC_LIBGOMP is not set
210[DEBUG]    # CT_CC_GCC_LIBSSP is not set
211[DEBUG]    CT_CC_CXA_ATEXIT=y
212[DEBUG]    # CT_CC_GCC_DISABLE_PCH is not set
213[DEBUG]    CT_CC_GCC_SJLJ_EXCEPTIONS=m
214[DEBUG]    # CT_CC_llvmgcc is not set
215[DEBUG]    CT_CC_SUPPORT_CXX=y
216[DEBUG]    CT_CC_SUPPORT_FORTRAN=y
217[DEBUG]    CT_CC_SUPPORT_JAVA=y
218[DEBUG]    CT_CC_SUPPORT_ADA=y
219[DEBUG]    CT_CC_SUPPORT_OBJC=y
220[DEBUG]    CT_CC_SUPPORT_OBJCXX=y
221[DEBUG]    CT_CC_LANG_CXX=y
222[DEBUG]    # CT_CC_LANG_JAVA is not set
223[DEBUG]    # CT_CC_LANG_ADA is not set
224[DEBUG]    CT_CC_LANG_OBJC=y
225[DEBUG]    CT_CC_LANG_OBJCXX=y
226[DEBUG]    CT_CC_LANG_OTHERS=""
227[DEBUG]    CT_LIBC="none"
228[DEBUG]    CT_LIBC_none=y
229[DEBUG]    CT_LIBC_eglibc_AVAILABLE=y
230[DEBUG]    CT_LIBC_glibc_AVAILABLE=y
231[DEBUG]    CT_LIBC_mingw_AVAILABLE=y
232[DEBUG]    CT_LIBC_newlib_AVAILABLE=y
233[DEBUG]    CT_LIBC_none_AVAILABLE=y
234[DEBUG]    CT_LIBC_uClibc_AVAILABLE=y
235[DEBUG]    CT_THREADS="nptl"
236[DEBUG]    # CT_DEBUG_dmalloc is not set
237[DEBUG]    # CT_DEBUG_duma is not set
238[DEBUG]    # CT_DEBUG_gdb is not set
239[DEBUG]    # CT_DEBUG_ltrace is not set
240[DEBUG]    # CT_DEBUG_strace is not set
241[DEBUG]    CT_COMPLIBS_NEEDED=y
242[DEBUG]    CT_GMP_NEEDED=y
243[DEBUG]    CT_MPFR_NEEDED=y
244[DEBUG]    CT_LLVM_NEEDED=y
245[DEBUG]    CT_LLVM_CLANG_NEEDED=y
246[DEBUG]    CT_OPENSSL_NEEDED=y
247[DEBUG]    CT_LIBUUID_NEEDED=y
248[DEBUG]    CT_COMPLIBS=y
249[DEBUG]    CT_GMP=y
250[DEBUG]    CT_MPFR=y
251[DEBUG]    CT_LLVM=y
252[DEBUG]    CT_OPENSSL=y
253[DEBUG]    CT_LIBUUID=y
254[DEBUG]    CT_GMP_V_5_1_1=y
255[DEBUG]    # CT_GMP_V_5_0_2 is not set
256[DEBUG]    # CT_GMP_V_5_0_1 is not set
257[DEBUG]    # CT_GMP_V_4_3_2 is not set
258[DEBUG]    # CT_GMP_V_4_3_1 is not set
259[DEBUG]    # CT_GMP_V_4_3_0 is not set
260[DEBUG]    CT_GMP_VERSION="5.1.1"
261[DEBUG]    CT_MPFR_V_3_1_2=y
262[DEBUG]    # CT_MPFR_V_3_1_0 is not set
263[DEBUG]    # CT_MPFR_V_3_0_1 is not set
264[DEBUG]    # CT_MPFR_V_3_0_0 is not set
265[DEBUG]    # CT_MPFR_V_2_4_2 is not set
266[DEBUG]    # CT_MPFR_V_2_4_1 is not set
267[DEBUG]    # CT_MPFR_V_2_4_0 is not set
268[DEBUG]    CT_MPFR_VERSION="3.1.2"
269[DEBUG]    CT_LIBUUID_E2FSPROGSLIBS=y
270[DEBUG]    # CT_LIBUUID_UTILLINUX is not set
271[DEBUG]    CT_LIBUUID_E2FSPROGSLIBS_V_1_41_14=y
272[DEBUG]    CT_LIBUUID_E2FSPROGSLIBS_VERSION="1.41.14"
273[DEBUG]    CT_OPENSSL_V_1_0_1_E=y
274[DEBUG]    # CT_OPENSSL_V_1_0_1_C is not set
275[DEBUG]    # CT_OPENSSL_V_1_0_1_B is not set
276[DEBUG]    CT_OPENSSL_VERSION="1.0.1e"
277[DEBUG]    # CT_LLVM_V_3_3 is not set
278[DEBUG]    # CT_LLVM_V_3_2 is not set
279[DEBUG]    # CT_LLVM_V_3_1 is not set
280[DEBUG]    # CT_LLVM_V_3_0 is not set
281[DEBUG]    # CT_LLVM_V_2_9 is not set
282[DEBUG]    # CT_LLVM_V_2_8 is not set
283[DEBUG]    CT_LLVM_V_2_7=y
284[DEBUG]    CT_LLVM_VERSION="2.7"
285[DEBUG]    # CT_COMPLIBS_CHECK is not set
286[DEBUG]    # CT_COMP_TOOLS is not set
287[DEBUG]    # CT_TEST_SUITE_GCC is not set
288[DEBUG]  Dumping user-supplied crosstool-NG configuration: done in 0.10s (at 00:00)
289[DEBUG]  Unsetting and unexporting MAKEFLAGS
290[INFO ]  Building environment variables
291[DEBUG]  Disabling companion tools 'make'
292[DEBUG]  Disabling companion tools 'm4'
293[DEBUG]  Disabling companion tools 'autoconf'
294[DEBUG]  Disabling companion tools 'automake'
295[DEBUG]  Disabling companion tools 'libtool'
296[DEBUG]  Enabling cc 'clang'
297[DEBUG]  Enabling cc 'gcc'
298[DEBUG]  Disabling cc 'llvmgcc'
299[DEBUG]  Disabling debug 'template'
300[DEBUG]  Disabling debug 'dmalloc'
301[DEBUG]  Disabling debug 'duma'
302[DEBUG]  Disabling debug 'gdb'
303[DEBUG]  Disabling debug 'ltrace'
304[DEBUG]  Disabling debug 'strace'
305[DEBUG]  Disabling test suite 'gcc'
306[DEBUG]  Testing '! ( -z /home/ubuntu/x-tools/i686-apple-darwin10 )'
307[WARN ]  Directory '/home/ubuntu/src' does not exist.
308[WARN ]  Will not save downloaded tarballs to local storage.
309[EXTRA]  Preparing working directories
310[DEBUG]  ==> Executing: 'mkdir' '-p' '/home/ubuntu/build/crosstool-ng/ct-ng-final/.build/tarballs'
311[DEBUG]  ==> Executing: 'mkdir' '-p' '/home/ubuntu/build/crosstool-ng/ct-ng-final/.build/src'
312[DEBUG]  ==> Executing: 'mkdir' '-p' '/home/ubuntu/build/crosstool-ng/ct-ng-final/.build/i686-apple-darwin10/build'
313[DEBUG]  ==> Executing: 'mkdir' '-p' '/home/ubuntu/build/crosstool-ng/ct-ng-final/.build/i686-apple-darwin10/buildtools/bin'
314[DEBUG]  ==> Executing: 'mkdir' '-p' '/home/ubuntu/build/crosstool-ng/ct-ng-final/.build/i686-apple-darwin10/build/configs'
315[DEBUG]  ==> Executing: 'mkdir' '-p' '/home/ubuntu/x-tools/i686-apple-darwin10'
316[DEBUG]  ==> Executing: 'mkdir' '-p' '/home/ubuntu/x-tools/i686-apple-darwin10'
317[DEBUG]  ==> Executing: 'mkdir' '-p' '/home/ubuntu/build/crosstool-ng/ct-ng-final/.build/i686-apple-darwin10/buildtools'
318[DEBUG]  ==> Executing: 'touch' '/home/ubuntu/x-tools/i686-apple-darwin10/foo'
319[DEBUG]  Testing '! ( -f /home/ubuntu/x-tools/i686-apple-darwin10/FOO )'
320[DEBUG]  ==> Executing: 'rm' '-f' '/home/ubuntu/x-tools/i686-apple-darwin10/foo'
321[DEBUG]  ==> Executing: 'chmod' '-R' 'u+w' '/home/ubuntu/x-tools/i686-apple-darwin10' '/home/ubuntu/x-tools/i686-apple-darwin10'
322[DEBUG]  Sanitised 'CT_SYSROOT_REL_DIR': 'sysroot' -> 'sysroot'
323[DEBUG]  Sanitised 'CT_SYSROOT_DIR': '/home/ubuntu/x-tools/i686-apple-darwin10/i686-apple-darwin10/sysroot' -> '/home/ubuntu/x-tools/i686-apple-darwin10/i686-apple-darwin10/sysroot'
324[DEBUG]  Sanitised 'CT_DEBUGROOT_DIR': '/home/ubuntu/x-tools/i686-apple-darwin10/i686-apple-darwin10//debug-root' -> '/home/ubuntu/x-tools/i686-apple-darwin10/i686-apple-darwin10/debug-root'
325[DEBUG]  Sanitised 'CT_HEADERS_DIR': '/home/ubuntu/x-tools/i686-apple-darwin10/i686-apple-darwin10/sysroot/usr/include' -> '/home/ubuntu/x-tools/i686-apple-darwin10/i686-apple-darwin10/sysroot/usr/include'
326[DEBUG]  ==> Executing: 'mkdir' '-p' '/home/ubuntu/x-tools/i686-apple-darwin10/i686-apple-darwin10/sysroot'
327[DEBUG]  ==> Executing: 'mkdir' '-p' '/home/ubuntu/x-tools/i686-apple-darwin10/i686-apple-darwin10/debug-root'
328[DEBUG]  ==> Executing: 'mkdir' '-p' '/home/ubuntu/x-tools/i686-apple-darwin10/lib'
329[DEBUG]  ==> Executing: 'mkdir' '-p' '/home/ubuntu/x-tools/i686-apple-darwin10/i686-apple-darwin10/sysroot/lib'
330[DEBUG]  ==> Executing: 'mkdir' '-p' '/home/ubuntu/x-tools/i686-apple-darwin10/i686-apple-darwin10/sysroot/usr/lib'
331[DEBUG]  ==> Executing: 'mkdir' '-p' '/home/ubuntu/x-tools/i686-apple-darwin10/i686-apple-darwin10/sysroot/usr/include'
332[DEBUG]  Entering '/home/ubuntu/x-tools/i686-apple-darwin10/i686-apple-darwin10'
333[DEBUG]  ==> Executing: 'ln' '-sf' 'sysroot/lib' 'lib'
334[DEBUG]  ==> Executing: 'ln' '-sf' 'lib' '/home/ubuntu/x-tools/i686-apple-darwin10/lib32'
335[DEBUG]  ==> Executing: 'ln' '-sf' 'lib' '/home/ubuntu/x-tools/i686-apple-darwin10/lib64'
336[DEBUG]  ==> Executing: 'ln' '-sf' 'lib' '/home/ubuntu/x-tools/i686-apple-darwin10/i686-apple-darwin10/sysroot/lib32'
337[DEBUG]  ==> Executing: 'ln' '-sf' 'lib' '/home/ubuntu/x-tools/i686-apple-darwin10/i686-apple-darwin10/sysroot/lib64'
338[DEBUG]  ==> Executing: 'ln' '-sf' 'lib' '/home/ubuntu/x-tools/i686-apple-darwin10/i686-apple-darwin10/sysroot/usr/lib32'
339[DEBUG]  ==> Executing: 'ln' '-sf' 'lib' '/home/ubuntu/x-tools/i686-apple-darwin10/i686-apple-darwin10/sysroot/usr/lib64'
340[DEBUG]  ==> Executing: 'ln' '-sf' 'lib' '/home/ubuntu/x-tools/i686-apple-darwin10/i686-apple-darwin10/lib32'
341[DEBUG]  ==> Executing: 'ln' '-sf' 'lib' '/home/ubuntu/x-tools/i686-apple-darwin10/i686-apple-darwin10/lib64'
342[DEBUG]  Making build system tools available
343[DEBUG]    'i686-build_pc-linux-gnu-ar' -> '/usr/bin/ar'
344[DEBUG]  ==> Executing: 'chmod' '700' '/home/ubuntu/build/crosstool-ng/ct-ng-final/.build/i686-apple-darwin10/buildtools/bin/i686-build_pc-linux-gnu-ar'
345[DEBUG]    'i686-build_pc-linux-gnu-as' -> '/usr/bin/as'
346[DEBUG]  ==> Executing: 'chmod' '700' '/home/ubuntu/build/crosstool-ng/ct-ng-final/.build/i686-apple-darwin10/buildtools/bin/i686-build_pc-linux-gnu-as'
347[DEBUG]    Missing: 'i686-pc-linux-gnu-dlltool' or 'i686-pc-linux-gnu-dlltool' or 'dlltool' : not required.
348[DEBUG]    'i686-build_pc-linux-gnu-gcc' -> '/usr/bin/gcc'
349[DEBUG]  ==> Executing: 'chmod' '700' '/home/ubuntu/build/crosstool-ng/ct-ng-final/.build/i686-apple-darwin10/buildtools/bin/i686-build_pc-linux-gnu-gcc'
350[DEBUG]    'i686-build_pc-linux-gnu-g++' -> '/usr/bin/g++'
351[DEBUG]  ==> Executing: 'chmod' '700' '/home/ubuntu/build/crosstool-ng/ct-ng-final/.build/i686-apple-darwin10/buildtools/bin/i686-build_pc-linux-gnu-g++'
352[DEBUG]    'i686-build_pc-linux-gnu-c++' -> '/usr/bin/c++'
353[DEBUG]  ==> Executing: 'chmod' '700' '/home/ubuntu/build/crosstool-ng/ct-ng-final/.build/i686-apple-darwin10/buildtools/bin/i686-build_pc-linux-gnu-c++'
354[DEBUG]  Testing '! (  = y )'
355[DEBUG]    Missing: 'i686-pc-linux-gnu-gnatbind' or 'i686-pc-linux-gnu-gnatbind' or 'gnatbind' : not required.
356[DEBUG]    Missing: 'i686-pc-linux-gnu-gnatmake' or 'i686-pc-linux-gnu-gnatmake' or 'gnatmake' : not required.
357[DEBUG]    'i686-build_pc-linux-gnu-ld' -> '/usr/bin/ld'
358[DEBUG]  ==> Executing: 'chmod' '700' '/home/ubuntu/build/crosstool-ng/ct-ng-final/.build/i686-apple-darwin10/buildtools/bin/i686-build_pc-linux-gnu-ld'
359[DEBUG]    'i686-build_pc-linux-gnu-nm' -> '/usr/bin/nm'
360[DEBUG]  ==> Executing: 'chmod' '700' '/home/ubuntu/build/crosstool-ng/ct-ng-final/.build/i686-apple-darwin10/buildtools/bin/i686-build_pc-linux-gnu-nm'
361[DEBUG]    'i686-build_pc-linux-gnu-objcopy' -> '/home/ubuntu/build/crosstool-ng/ct-ng-final/.build/tools/bin/objcopy'
362[DEBUG]  ==> Executing: 'chmod' '700' '/home/ubuntu/build/crosstool-ng/ct-ng-final/.build/i686-apple-darwin10/buildtools/bin/i686-build_pc-linux-gnu-objcopy'
363[DEBUG]    'i686-build_pc-linux-gnu-objdump' -> '/home/ubuntu/build/crosstool-ng/ct-ng-final/.build/tools/bin/objdump'
364[DEBUG]  ==> Executing: 'chmod' '700' '/home/ubuntu/build/crosstool-ng/ct-ng-final/.build/i686-apple-darwin10/buildtools/bin/i686-build_pc-linux-gnu-objdump'
365[DEBUG]    'i686-build_pc-linux-gnu-ranlib' -> '/usr/bin/ranlib'
366[DEBUG]  ==> Executing: 'chmod' '700' '/home/ubuntu/build/crosstool-ng/ct-ng-final/.build/i686-apple-darwin10/buildtools/bin/i686-build_pc-linux-gnu-ranlib'
367[DEBUG]    'i686-build_pc-linux-gnu-strip' -> '/usr/bin/strip'
368[DEBUG]  ==> Executing: 'chmod' '700' '/home/ubuntu/build/crosstool-ng/ct-ng-final/.build/i686-apple-darwin10/buildtools/bin/i686-build_pc-linux-gnu-strip'
369[DEBUG]    Missing: 'i686-pc-linux-gnu-windres' or 'i686-pc-linux-gnu-windres' or 'windres' : not required.
370[DEBUG]    'i686-build_pc-linux-gnu-ar' -> '/usr/bin/ar'
371[DEBUG]  ==> Executing: 'chmod' '700' '/home/ubuntu/build/crosstool-ng/ct-ng-final/.build/i686-apple-darwin10/buildtools/bin/i686-build_pc-linux-gnu-ar'
372[DEBUG]    'i686-build_pc-linux-gnu-as' -> '/usr/bin/as'
373[DEBUG]  ==> Executing: 'chmod' '700' '/home/ubuntu/build/crosstool-ng/ct-ng-final/.build/i686-apple-darwin10/buildtools/bin/i686-build_pc-linux-gnu-as'
374[DEBUG]    Missing: 'i686-pc-linux-gnu-dlltool' or 'i686-pc-linux-gnu-dlltool' or 'dlltool' : not required.
375[DEBUG]    'i686-build_pc-linux-gnu-gcc' -> '/usr/bin/gcc'
376[DEBUG]  ==> Executing: 'chmod' '700' '/home/ubuntu/build/crosstool-ng/ct-ng-final/.build/i686-apple-darwin10/buildtools/bin/i686-build_pc-linux-gnu-gcc'
377[DEBUG]    'i686-build_pc-linux-gnu-g++' -> '/usr/bin/g++'
378[DEBUG]  ==> Executing: 'chmod' '700' '/home/ubuntu/build/crosstool-ng/ct-ng-final/.build/i686-apple-darwin10/buildtools/bin/i686-build_pc-linux-gnu-g++'
379[DEBUG]    'i686-build_pc-linux-gnu-c++' -> '/usr/bin/c++'
380[DEBUG]  ==> Executing: 'chmod' '700' '/home/ubuntu/build/crosstool-ng/ct-ng-final/.build/i686-apple-darwin10/buildtools/bin/i686-build_pc-linux-gnu-c++'
381[DEBUG]  Testing '! (  = y )'
382[DEBUG]    Missing: 'i686-pc-linux-gnu-gnatbind' or 'i686-pc-linux-gnu-gnatbind' or 'gnatbind' : not required.
383[DEBUG]    Missing: 'i686-pc-linux-gnu-gnatmake' or 'i686-pc-linux-gnu-gnatmake' or 'gnatmake' : not required.
384[DEBUG]    'i686-build_pc-linux-gnu-ld' -> '/usr/bin/ld'
385[DEBUG]  ==> Executing: 'chmod' '700' '/home/ubuntu/build/crosstool-ng/ct-ng-final/.build/i686-apple-darwin10/buildtools/bin/i686-build_pc-linux-gnu-ld'
386[DEBUG]    'i686-build_pc-linux-gnu-nm' -> '/usr/bin/nm'
387[DEBUG]  ==> Executing: 'chmod' '700' '/home/ubuntu/build/crosstool-ng/ct-ng-final/.build/i686-apple-darwin10/buildtools/bin/i686-build_pc-linux-gnu-nm'
388[DEBUG]    'i686-build_pc-linux-gnu-objcopy' -> '/home/ubuntu/build/crosstool-ng/ct-ng-final/.build/tools/bin/objcopy'
389[DEBUG]  ==> Executing: 'chmod' '700' '/home/ubuntu/build/crosstool-ng/ct-ng-final/.build/i686-apple-darwin10/buildtools/bin/i686-build_pc-linux-gnu-objcopy'
390[DEBUG]    'i686-build_pc-linux-gnu-objdump' -> '/home/ubuntu/build/crosstool-ng/ct-ng-final/.build/tools/bin/objdump'
391[DEBUG]  ==> Executing: 'chmod' '700' '/home/ubuntu/build/crosstool-ng/ct-ng-final/.build/i686-apple-darwin10/buildtools/bin/i686-build_pc-linux-gnu-objdump'
392[DEBUG]    'i686-build_pc-linux-gnu-ranlib' -> '/usr/bin/ranlib'
393[DEBUG]  ==> Executing: 'chmod' '700' '/home/ubuntu/build/crosstool-ng/ct-ng-final/.build/i686-apple-darwin10/buildtools/bin/i686-build_pc-linux-gnu-ranlib'
394[DEBUG]    'i686-build_pc-linux-gnu-strip' -> '/usr/bin/strip'
395[DEBUG]  ==> Executing: 'chmod' '700' '/home/ubuntu/build/crosstool-ng/ct-ng-final/.build/i686-apple-darwin10/buildtools/bin/i686-build_pc-linux-gnu-strip'
396[DEBUG]    Missing: 'i686-pc-linux-gnu-windres' or 'i686-pc-linux-gnu-windres' or 'windres' : not required.
397[DEBUG]    'makeinfo' -> '/usr/bin/makeinfo'
398[DEBUG]  ==> Executing: 'chmod' '700' '/home/ubuntu/build/crosstool-ng/ct-ng-final/.build/i686-apple-darwin10/buildtools/bin/makeinfo'
399[DEBUG]  CFLAGS for host compiler: '-O2 -g -pipe -m32'
400[DEBUG]  LDFLAGS for host compiler: ' -m32'
401[DEBUG]  =================================================================
402[DEBUG]  Checking that we can run gcc -v
403[DEBUG]    ==> Executing: 'i686-build_pc-linux-gnu-gcc' '-v'
404[DEBUG]    Using built-in specs.
405[DEBUG]    COLLECT_GCC=/usr/bin/gcc
406[DEBUG]    COLLECT_LTO_WRAPPER=/usr/lib/gcc/i686-linux-gnu/4.6/lto-wrapper
407[DEBUG]    Target: i686-linux-gnu
408[DEBUG]    Configured with: ../src/configure -v --with-pkgversion='Ubuntu/Linaro 4.6.3-1ubuntu5' --with-bugurl=file:///usr/share/doc/gcc-4.6/README.Bugs --enable-languages=c,c++,fortran,objc,obj-c++ --prefix=/usr --program-suffix=-4.6 --enable-shared --enable-linker-build-id --with-system-zlib --libexecdir=/usr/lib --without-included-gettext --enable-threads=posix --with-gxx-include-dir=/usr/include/c++/4.6 --libdir=/usr/lib --enable-nls --with-sysroot=/ --enable-clocale=gnu --enable-libstdcxx-debug --enable-libstdcxx-time=yes --enable-gnu-unique-object --enable-plugin --enable-objc-gc --enable-targets=all --disable-werror --with-arch-32=i686 --with-tune=generic --enable-checking=release --build=i686-linux-gnu --host=i686-linux-gnu --target=i686-linux-gnu
409[DEBUG]    Thread model: posix
410[DEBUG]    gcc version 4.6.3 (Ubuntu/Linaro 4.6.3-1ubuntu5)
411[DEBUG]  Checking that we can run gcc -v: done in 0.02s (at 00:00)
412[DEBUG]  =================================================================
413[DEBUG]  Checking that gcc can compile a trivial program
414[DEBUG]    ==> Executing: 'i686-build_pc-linux-gnu-gcc' '-O2' '-g' '-pipe' '-m32' '-m32' '/home/ubuntu/build/crosstool-ng/ct-ng-final/.build/i686-apple-darwin10/build/test.c' '-o' '/home/ubuntu/build/crosstool-ng/ct-ng-final/.build/i686-apple-darwin10/build/.gccout'
415[DEBUG]  Checking that gcc can compile a trivial program: done in 0.07s (at 00:00)
416[EXTRA]  Installing user-supplied crosstool-NG configuration
417[DEBUG]  ==> Executing: 'mkdir' '-p' '/home/ubuntu/x-tools/i686-apple-darwin10/bin'
418[DEBUG]  ==> Executing: 'install' '-m' '0755' '/usr/local/lib/ct-ng.hg+unknown-20000101.000000/scripts/toolchain-config.in' '/home/ubuntu/x-tools/i686-apple-darwin10/bin/i686-apple-darwin10-ct-ng.config'
419[DEBUG]  ==> Executing: 'sed' '-i' '-e' 's,@@grep@@,"/bin/grep",;' '/home/ubuntu/x-tools/i686-apple-darwin10/bin/i686-apple-darwin10-ct-ng.config'
420[EXTRA]  =================================================================
421[EXTRA]  Dumping internal crosstool-NG configuration
422[EXTRA]    Building a toolchain for:
423[EXTRA]      build  = i686-pc-linux-gnu
424[EXTRA]      host   = i686-pc-linux-gnu
425[EXTRA]      target = i686-apple-darwin10
426[DEBUG]    CT_ARCH=x86
427[DEBUG]    CT_ARCH_32=y
428[DEBUG]    CT_ARCH_ARCH=
429[DEBUG]    CT_ARCH_BINFMT_MACH_O=y
430[DEBUG]    CT_ARCH_BITNESS=32
431[DEBUG]    CT_ARCH_CPU=
432[DEBUG]    CT_ARCH_DEFAULT_32=y
433[DEBUG]    CT_ARCH_FLOAT=
434[DEBUG]    CT_ARCH_SUFFIX=
435[DEBUG]    CT_ARCH_SUPPORTS_32=y
436[DEBUG]    CT_ARCH_SUPPORTS_64=y
437[DEBUG]    CT_ARCH_SUPPORTS_WITH_ARCH=y
438[DEBUG]    CT_ARCH_SUPPORTS_WITH_CPU=y
439[DEBUG]    CT_ARCH_SUPPORTS_WITH_TUNE=y
440[DEBUG]    CT_ARCH_TARGET_CFLAGS='     -mtune=i686  '
441[DEBUG]    CT_ARCH_TARGET_LDFLAGS=' '
442[DEBUG]    CT_ARCH_TUNE=i686
443[DEBUG]    CT_ARCH_TUNE_CFLAG=-mtune=i686
444[DEBUG]    CT_ARCH_USE_MMU=y
445[DEBUG]    CT_ARCH_WITH_TUNE=--with-tune=i686
446[DEBUG]    CT_ARCH_alpha_AVAILABLE=y
447[DEBUG]    CT_ARCH_arm_AVAILABLE=y
448[DEBUG]    CT_ARCH_avr32_AVAILABLE=y
449[DEBUG]    CT_ARCH_blackfin_AVAILABLE=y
450[DEBUG]    CT_ARCH_m68k_AVAILABLE=y
451[DEBUG]    CT_ARCH_microblaze_AVAILABLE=y
452[DEBUG]    CT_ARCH_mips_AVAILABLE=y
453[DEBUG]    CT_ARCH_powerpc_AVAILABLE=y
454[DEBUG]    CT_ARCH_s390_AVAILABLE=y
455[DEBUG]    CT_ARCH_sh_AVAILABLE=y
456[DEBUG]    CT_ARCH_sparc_AVAILABLE=y
457[DEBUG]    CT_ARCH_x86=y
458[DEBUG]    CT_ARCH_x86_AVAILABLE=y
459[DEBUG]    CT_BINUTILS=cctools
460[DEBUG]    CT_BINUTILS_VERSION=809
461[DEBUG]    CT_BINUTILS_cctools=y
462[DEBUG]    CT_BUILD=i686-build_pc-linux-gnu
463[DEBUG]    CT_BUILDTOOLS_PREFIX_DIR=/home/ubuntu/build/crosstool-ng/ct-ng-final/.build/i686-apple-darwin10/buildtools
464[DEBUG]    CT_BUILD_DIR=/home/ubuntu/build/crosstool-ng/ct-ng-final/.build/i686-apple-darwin10/build
465[DEBUG]    CT_BUILD_PREFIX=
466[DEBUG]    CT_BUILD_SUFFIX=
467[DEBUG]    CT_CCTOOLS_V_809=y
468[DEBUG]    CT_CC_CLANG_VERSION=2.7
469[DEBUG]    CT_CC_CLANG_V_2_7=y
470[DEBUG]    CT_CC_CXA_ATEXIT=y
471[DEBUG]    CT_CC_FACILITY_LIST=' clang gcc'
472[DEBUG]    CT_CC_GCC_APPLE=y
473[DEBUG]    CT_CC_GCC_CORE_EXTRA_CONFIG_ARRAY=()
474[DEBUG]    CT_CC_GCC_ENABLE_CXX_FLAGS=
475[DEBUG]    CT_CC_GCC_ENABLE_TARGET_OPTSPACE=y
476[DEBUG]    CT_CC_GCC_EXTRA_CONFIG_ARRAY=()
477[DEBUG]    CT_CC_GCC_SJLJ_EXCEPTIONS=m
478[DEBUG]    CT_CC_GCC_VERSION=5666.3
479[DEBUG]    CT_CC_GCC_V_apple_5666_3=y
480[DEBUG]    CT_CC_LANG_CXX=y
481[DEBUG]    CT_CC_LANG_OBJC=y
482[DEBUG]    CT_CC_LANG_OBJCXX=y
483[DEBUG]    CT_CC_LANG_OTHERS=
484[DEBUG]    CT_CC_LLVMGCC_CORE_EXTRA_CONFIG_ARRAY=()
485[DEBUG]    CT_CC_LLVMGCC_EXTRA_CONFIG_ARRAY=()
486[DEBUG]    CT_CC_SUPPORT_ADA=y
487[DEBUG]    CT_CC_SUPPORT_CXX=y
488[DEBUG]    CT_CC_SUPPORT_FORTRAN=y
489[DEBUG]    CT_CC_SUPPORT_JAVA=y
490[DEBUG]    CT_CC_SUPPORT_OBJC=y
491[DEBUG]    CT_CC_SUPPORT_OBJCXX=y
492[DEBUG]    CT_CC_clang=y
493[DEBUG]    CT_CC_gcc=y
494[DEBUG]    CT_CFLAGS_FOR_BUILD='-O2 -g -m32'
495[DEBUG]    CT_CFLAGS_FOR_HOST='-O2 -g -pipe -m32'
496[DEBUG]    CT_CLANG_FULLNAME=clang-2.7
497[DEBUG]    CT_COMPLIBS=y
498[DEBUG]    CT_COMPLIBS_NEEDED=y
499[DEBUG]    CT_COMP_LIBS_FACILITY_LIST=' gmp mpfr ppl isl cloog mpc llvm libelf libuuid openssl'
500[DEBUG]    CT_COMP_TOOLS_FACILITY_LIST=
501[DEBUG]    CT_CONFIGURE_has_svn=y
502[DEBUG]    CT_CONFIGURE_has_xz=y
503[DEBUG]    CT_CONFIG_DIR=/home/ubuntu/build/crosstool-ng/ct-ng-final/.build/i686-apple-darwin10/build/configs
504[DEBUG]    CT_CONFIG_SHELL=/bin/bash
505[DEBUG]    CT_CONFIG_SHELL_BASH=y
506[DEBUG]    CT_CONNECT_TIMEOUT=10
507[DEBUG]    CT_CROSS=y
508[DEBUG]    CT_CUSTOM_LOCATION_ROOT_DIR=
509[DEBUG]    CT_DARWIN=y
510[DEBUG]    CT_DARWIN_MAC_OSX_V_10_6=y
511[DEBUG]    CT_DARWIN_SDK=MacOSX10.6.sdk
512[DEBUG]    CT_DARWIN_SDK_PATH=/home/ubuntu/MacOSX10.6.sdk
513[DEBUG]    CT_DARWIN_VERSION=10
514[DEBUG]    CT_DEBUGROOT_DIR=/home/ubuntu/x-tools/i686-apple-darwin10/i686-apple-darwin10/debug-root
515[DEBUG]    CT_DEBUG_FACILITY_LIST=
516[DEBUG]    CT_DOC_DIR=/usr/local/share/doc/crosstool-ng/ct-ng.hg+unknown-20000101.000000
517[DEBUG]    CT_DYLD_VERSION=210.2.3
518[DEBUG]    CT_EXPERIMENTAL=y
519[DEBUG]    CT_EXTRA_CFLAGS_FOR_BUILD=-m32
520[DEBUG]    CT_EXTRA_CFLAGS_FOR_HOST=-m32
521[DEBUG]    CT_EXTRA_LDFLAGS_FOR_BUILD=-m32
522[DEBUG]    CT_EXTRA_LDFLAGS_FOR_HOST=-m32
523[DEBUG]    CT_FORCE_SYSROOT=y
524[DEBUG]    CT_GMP=y
525[DEBUG]    CT_GMP_NEEDED=y
526[DEBUG]    CT_GMP_VERSION=5.1.1
527[DEBUG]    CT_GMP_V_5_1_1=y
528[DEBUG]    CT_HEADERS_DIR=/home/ubuntu/x-tools/i686-apple-darwin10/i686-apple-darwin10/sysroot/usr/include
529[DEBUG]    CT_HOST=i686-build_pc-linux-gnu
530[DEBUG]    CT_HOST_COMPLIBS_DIR=/home/ubuntu/build/crosstool-ng/ct-ng-final/.build/i686-apple-darwin10/buildtools
531[DEBUG]    CT_INSTALL_DIR=/home/ubuntu/x-tools/i686-apple-darwin10
532[DEBUG]    CT_INSTALL_DIR_RO=y
533[DEBUG]    CT_KERNEL=darwin
534[DEBUG]    CT_KERNEL_SUPPORTS_SHARED_LIBS=y
535[DEBUG]    CT_KERNEL_bare_metal_AVAILABLE=y
536[DEBUG]    CT_KERNEL_darwin=y
537[DEBUG]    CT_KERNEL_darwin_AVAILABLE=y
538[DEBUG]    CT_KERNEL_linux_AVAILABLE=y
539[DEBUG]    CT_KERNEL_windows_AVAILABLE=y
540[DEBUG]    CT_LD64_VERSION=127.2
541[DEBUG]    CT_LDFLAGS_FOR_BUILD=' -m32'
542[DEBUG]    CT_LDFLAGS_FOR_HOST=' -m32'
543[DEBUG]    CT_LIBC=none
544[DEBUG]    CT_LIBC_eglibc_AVAILABLE=y
545[DEBUG]    CT_LIBC_glibc_AVAILABLE=y
546[DEBUG]    CT_LIBC_mingw_AVAILABLE=y
547[DEBUG]    CT_LIBC_newlib_AVAILABLE=y
548[DEBUG]    CT_LIBC_none=y
549[DEBUG]    CT_LIBC_none_AVAILABLE=y
550[DEBUG]    CT_LIBC_uClibc_AVAILABLE=y
551[DEBUG]    CT_LIBUUID=y
552[DEBUG]    CT_LIBUUID_E2FSPROGSLIBS=y
553[DEBUG]    CT_LIBUUID_E2FSPROGSLIBS_VERSION=1.41.14
554[DEBUG]    CT_LIBUUID_E2FSPROGSLIBS_V_1_41_14=y
555[DEBUG]    CT_LIBUUID_NEEDED=y
556[DEBUG]    CT_LIB_DIR=/usr/local/lib/ct-ng.hg+unknown-20000101.000000
557[DEBUG]    CT_LLVM=y
558[DEBUG]    CT_LLVM_CLANG_NEEDED=y
559[DEBUG]    CT_LLVM_FULLNAME=llvm-2.7
560[DEBUG]    CT_LLVM_NEEDED=y
561[DEBUG]    CT_LLVM_SUFFIX=
562[DEBUG]    CT_LLVM_VERSION=2.7
563[DEBUG]    CT_LLVM_V_2_7=y
564[DEBUG]    CT_LOAD=
565[DEBUG]    CT_LOCAL_TARBALLS_DIR=/home/ubuntu/src
566[DEBUG]    CT_LOG_EXTRA=y
567[DEBUG]    CT_LOG_FILE_COMPRESS=y
568[DEBUG]    CT_LOG_LEVEL_ALL=7
569[DEBUG]    CT_LOG_LEVEL_CFG=4
570[DEBUG]    CT_LOG_LEVEL_DEBUG=8
571[DEBUG]    CT_LOG_LEVEL_ERROR=0
572[DEBUG]    CT_LOG_LEVEL_EXTRA=3
573[DEBUG]    CT_LOG_LEVEL_FILE=5
574[DEBUG]    CT_LOG_LEVEL_INFO=2
575[DEBUG]    CT_LOG_LEVEL_MAX=EXTRA
576[DEBUG]    CT_LOG_LEVEL_STATE=6
577[DEBUG]    CT_LOG_LEVEL_WARN=1
578[DEBUG]    CT_LOG_PROGRESS_BAR=y
579[DEBUG]    CT_LOG_TO_FILE=y
580[DEBUG]    CT_MODULES=y
581[DEBUG]    CT_MPFR=y
582[DEBUG]    CT_MPFR_NEEDED=y
583[DEBUG]    CT_MPFR_VERSION=3.1.2
584[DEBUG]    CT_MPFR_V_3_1_2=y
585[DEBUG]    CT_MULTILIB=y
586[DEBUG]    CT_NG=/usr/local/bin/ct-ng
587[DEBUG]    CT_OPENSSL=y
588[DEBUG]    CT_OPENSSL_NEEDED=y
589[DEBUG]    CT_OPENSSL_VERSION=1.0.1e
590[DEBUG]    CT_OPENSSL_V_1_0_1_E=y
591[DEBUG]    CT_OVERIDE_CONFIG_GUESS_SUB=y
592[DEBUG]    CT_PARALLEL_JOBS=0
593[DEBUG]    CT_PATCH_BUNDLED=y
594[DEBUG]    CT_PATCH_ORDER=bundled
595[DEBUG]    CT_PKGVERSION='crosstool-NG hg+unknown-20000101.000000'
596[DEBUG]    CT_PREFIX_DIR=/home/ubuntu/x-tools/i686-apple-darwin10
597[DEBUG]    CT_REAL_BUILD=i686-pc-linux-gnu
598[DEBUG]    CT_REAL_HOST=i686-pc-linux-gnu
599[DEBUG]    CT_REAL_TARGET=i686-apple-darwin10
600[DEBUG]    CT_REMOVE_DOCS=y
601[DEBUG]    CT_RESTART=
602[DEBUG]    CT_RM_RF_PREFIX_DIR=y
603[DEBUG]    CT_SAVE_TARBALLS=
604[DEBUG]    CT_SHARED_LIBS=y
605[DEBUG]    CT_SRC_DIR=/home/ubuntu/build/crosstool-ng/ct-ng-final/.build/src
606[DEBUG]    CT_STAR_DATE=946684800428380215
607[DEBUG]    CT_STAR_DATE_HUMAN=20000101.000000
608[DEBUG]    CT_STATE_DIR=/home/ubuntu/build/crosstool-ng/ct-ng-final/.build/i686-apple-darwin10/state
609[DEBUG]    CT_STEPS='libc_check_config companion_libs_for_build binutils_for_build companion_libs_for_host binutils_for_host cc_core_pass_1 kernel_headers libc_start_files cc_core_pass_2 libc cc_for_build cc_for_host libelf_for_target binutils_for_target debug test_suite finish '
610[DEBUG]    CT_STEP_COUNT=2
611[DEBUG]    CT_STEP_LEVEL=([2]="EXTRA")
612[DEBUG]    CT_STEP_MESSAGE=([1]="(top-level)" [2]="Dumping internal crosstool-NG configuration")
613[DEBUG]    CT_STEP_START=([2]="946684800653563395")
614[DEBUG]    CT_STOP=
615[DEBUG]    CT_STRIP_ALL_TOOLCHAIN_EXECUTABLES=y
616[DEBUG]    CT_SYSROOT_DIR=/home/ubuntu/x-tools/i686-apple-darwin10/i686-apple-darwin10/sysroot
617[DEBUG]    CT_SYSROOT_DIR_PREFIX=
618[DEBUG]    CT_SYSROOT_NAME=sysroot
619[DEBUG]    CT_SYSROOT_REL_DIR=sysroot
620[DEBUG]    CT_SYS_GCC=4.6
621[DEBUG]    CT_SYS_HOSTNAME=ubuntu.defaultdomain
622[DEBUG]    CT_SYS_KERNEL=Linux
623[DEBUG]    CT_SYS_MACHINE=i686
624[DEBUG]    CT_SYS_OS=Linux
625[DEBUG]    CT_SYS_PROCESSOR=i686
626[DEBUG]    CT_SYS_REVISION=3.2.0-45-virtual
627[DEBUG]    CT_SYS_TARGET=i686-pc-linux-gnu
628[DEBUG]    CT_SYS_USER=ubuntu
629[DEBUG]    CT_TARBALLS_DIR=/home/ubuntu/build/crosstool-ng/ct-ng-final/.build/tarballs
630[DEBUG]    CT_TARGET=i686-apple-darwin10
631[DEBUG]    CT_TARGET_ALIAS=
632[DEBUG]    CT_TARGET_ALIAS_SED_EXPR=
633[DEBUG]    CT_TARGET_ARCH=i686
634[DEBUG]    CT_TARGET_CFLAGS='     -mtune=i686   '
635[DEBUG]    CT_TARGET_KERNEL=darwin10
636[DEBUG]    CT_TARGET_LDFLAGS='  '
637[DEBUG]    CT_TARGET_SYS=
638[DEBUG]    CT_TARGET_VENDOR=apple
639[DEBUG]    CT_TEST_SUITE_DIR=/home/ubuntu/x-tools/i686-apple-darwin10/test-suite
640[DEBUG]    CT_TEST_SUITE_FACILITY_LIST=
641[DEBUG]    CT_THREADS=nptl
642[DEBUG]    CT_TOOLCHAIN_BUGURL=
643[DEBUG]    CT_TOOLCHAIN_ID='crosstool-hg+unknown-20000101.000000 build 20000101.000000 by ubuntu@ubuntu.defaultdomain'
644[DEBUG]    CT_TOOLCHAIN_PKGVERSION=
645[DEBUG]    CT_TOOLCHAIN_TYPE=cross
646[DEBUG]    CT_TOOLS_OVERIDE_DIR=/home/ubuntu/build/crosstool-ng/ct-ng-final/.build/tools
647[DEBUG]    CT_TOP_DIR=/home/ubuntu/build/crosstool-ng/ct-ng-final
648[DEBUG]    CT_USE_PIPES=y
649[DEBUG]    CT_USE_SYSROOT=y
650[DEBUG]    CT_VERSION=hg+unknown-20000101.000000
651[DEBUG]    CT_WORK_DIR=/home/ubuntu/build/crosstool-ng/ct-ng-final/.build
652[DEBUG]    Other environment:
653[DEBUG]    grep=/bin/grep
654[DEBUG]    SHELL=/bin/bash
655[DEBUG]    SSH_CLIENT=10.0.2.2 45763 22
656[DEBUG]    LD_PRELOAD=/usr/lib/faketime/libfaketime.so.1
657[DEBUG]    patch=/usr/bin/patch
658[DEBUG]    bash=/bin/bash
659[DEBUG]    libtoolize=/usr/bin/libtoolize
660[DEBUG]    OLDPWD=/home/ubuntu/x-tools/i686-apple-darwin10/i686-apple-darwin10
661[DEBUG]    objcopy=/usr/bin/objcopy
662[DEBUG]    LC_ALL=C
663[DEBUG]    USER=ubuntu
664[DEBUG]    install=/usr/bin/install -c
665[DEBUG]    V=
666[DEBUG]    CONFIG_SITE=
667[DEBUG]    MAKELEVEL=1
668[DEBUG]    OUTDIR=/home/ubuntu/out
669[DEBUG]    MFLAGS=- --no-print-directory -r
670[DEBUG]    readelf=/usr/bin/readelf
671[DEBUG]    ECHO=echo
672[DEBUG]    KCONFIG_TOP=config/config.in
673[DEBUG]    PATH=/home/ubuntu/x-tools/i686-apple-darwin10/bin:/home/ubuntu/build/crosstool-ng/ct-ng-final/.build/i686-apple-darwin10/buildtools/bin:/home/ubuntu/build/crosstool-ng/ct-ng-final/.build/tools/bin:/usr/local/sbin:/usr/local/bin:/usr/sbin:/usr/bin:/sbin:/bin:/usr/games:/usr/apple-osx/bin/:/usr/local/ct-ng-build
674[DEBUG]    objdump=/usr/bin/objdump
675[DEBUG]    MAIL=/var/mail/ubuntu
676[DEBUG]    sed=/bin/sed
677[DEBUG]    PWD=/home/ubuntu/build/crosstool-ng/ct-ng-final
678[DEBUG]    gperf=/usr/bin/gperf
679[DEBUG]    CONF=/usr/local/lib/ct-ng.hg+unknown-20000101.000000/kconfig/conf
680[DEBUG]    LANG=C
681[DEBUG]    TZ=UTC
682[DEBUG]    awk=/usr/bin/awk
683[DEBUG]    CONFIG_SHELL=/bin/bash
684[DEBUG]    HOME=/home/ubuntu
685[DEBUG]    SHLVL=4
686[DEBUG]    make=/usr/bin/make
687[DEBUG]    GREP_OPTIONS=
688[DEBUG]    FAKETIME=2000-01-01 00:00:00
689[DEBUG]    libtool=/usr/bin/libtool
690[DEBUG]    SILENT=@
691[DEBUG]    LOGNAME=ubuntu
692[DEBUG]    SSH_CONNECTION=10.0.2.2 45763 10.0.2.15 22
693[DEBUG]    _=/usr/bin/printenv
694[EXTRA]  Dumping internal crosstool-NG configuration: done in 0.14s (at 00:00)
695
696[snip...]
697
698[ALL  ]    make[3]: Entering directory `/home/ubuntu/build/crosstool-ng/ct-ng-final/.build/i686-apple-darwin10/build/build-LLVM-host-i686-build_pc-linux-gnu/utils/unittest'
699[ALL  ]    make[3]: Warning: File `/home/ubuntu/build/crosstool-ng/ct-ng-final/.build/i686-apple-darwin10/build/build-LLVM-host-i686-build_pc-linux-gnu/Makefile.rules' has modification time 0.57 s in the future
700[ALL  ]    llvm[3]: Regenerating /home/ubuntu/build/crosstool-ng/ct-ng-final/.build/i686-apple-darwin10/build/build-LLVM-host-i686-build_pc-linux-gnu/Makefile.config
701[ALL  ]    config.status: creating Makefile.config
702[ALL  ]    make[4]: Entering directory `/home/ubuntu/build/crosstool-ng/ct-ng-final/.build/i686-apple-darwin10/build/build-LLVM-host-i686-build_pc-linux-gnu/utils/unittest/googletest'
703[ALL  ]    make[4]: Warning: File `/home/ubuntu/build/crosstool-ng/ct-ng-final/.build/i686-apple-darwin10/build/build-LLVM-host-i686-build_pc-linux-gnu/Makefile.rules' has modification time 0.039 s in the future
704[ALL  ]    llvm[4]: Regenerating /home/ubuntu/build/crosstool-ng/ct-ng-final/.build/i686-apple-darwin10/build/build-LLVM-host-i686-build_pc-linux-gnu/Makefile.config
705[ALL  ]    config.status: creating Makefile.config
706[ALL  ]    make[4]: Leaving directory `/home/ubuntu/build/crosstool-ng/ct-ng-final/.build/i686-apple-darwin10/build/build-LLVM-host-i686-build_pc-linux-gnu/utils/unittest/googletest'
707[ALL  ]    make[4]: Entering directory `/home/ubuntu/build/crosstool-ng/ct-ng-final/.build/i686-apple-darwin10/build/build-LLVM-host-i686-build_pc-linux-gnu/utils/unittest/googletest'
708[ALL  ]    make[4]: Warning: File `/home/ubuntu/build/crosstool-ng/ct-ng-final/.build/i686-apple-darwin10/build/build-LLVM-host-i686-build_pc-linux-gnu/Makefile.rules' has modification time 0.015 s in the future
709[ALL  ]    llvm[4]: Regenerating /home/ubuntu/build/crosstool-ng/ct-ng-final/.build/i686-apple-darwin10/build/build-LLVM-host-i686-build_pc-linux-gnu/Makefile.config
710[ALL  ]    config.status: creating Makefile.config
711[ALL  ]    llvm[3]: Linking Release executable FileCheck (without symbols)
712[ALL  ]    make[4]: Leaving directory `/home/ubuntu/build/crosstool-ng/ct-ng-final/.build/i686-apple-darwin10/build/build-LLVM-host-i686-build_pc-linux-gnu/utils/unittest/googletest'
713[ALL  ]    make[4]: Entering directory `/home/ubuntu/build/crosstool-ng/ct-ng-final/.build/i686-apple-darwin10/build/build-LLVM-host-i686-build_pc-linux-gnu/utils/unittest/googletest'
714[ALL  ]    make[4]: Warning: File `/home/ubuntu/build/crosstool-ng/ct-ng-final/.build/i686-apple-darwin10/build/build-LLVM-host-i686-build_pc-linux-gnu/config.status' has modification time 0.13 s in the future
715[ALL  ]    llvm[4]: Regenerating /home/ubuntu/build/crosstool-ng/ct-ng-final/.build/i686-apple-darwin10/build/build-LLVM-host-i686-build_pc-linux-gnu/Makefile.config
716[ALL  ]    llvm[3]: ======= Finished Linking Release Executable FileCheck (without symbols)
717[ALL  ]    make[3]: warning:  Clock skew detected.  Your build may be incomplete.
718[ALL  ]    make[3]: Leaving directory `/home/ubuntu/build/crosstool-ng/ct-ng-final/.build/i686-apple-darwin10/build/build-LLVM-host-i686-build_pc-linux-gnu/utils/FileCheck'
719[ALL  ]    make[4]: Entering directory `/home/ubuntu/build/crosstool-ng/ct-ng-final/.build/i686-apple-darwin10/build/build-LLVM-host-i686-build_pc-linux-gnu/utils/unittest/UnitTestMain'
720[ALL  ]    make[4]: Warning: File `/home/ubuntu/build/crosstool-ng/ct-ng-final/.build/i686-apple-darwin10/build/build-LLVM-host-i686-build_pc-linux-gnu/Makefile.rules' has modification time 0.76 s in the future
721[ALL  ]    llvm[4]: Regenerating /home/ubuntu/build/crosstool-ng/ct-ng-final/.build/i686-apple-darwin10/build/build-LLVM-host-i686-build_pc-linux-gnu/Makefile.config
722[ALL  ]    config.status: creating Makefile.config
723[ALL  ]    config.status: creating Makefile.config
724[ALL  ]    make[4]: Leaving directory `/home/ubuntu/build/crosstool-ng/ct-ng-final/.build/i686-apple-darwin10/build/build-LLVM-host-i686-build_pc-linux-gnu/utils/unittest/googletest'
725[ALL  ]    make[4]: Entering directory `/home/ubuntu/build/crosstool-ng/ct-ng-final/.build/i686-apple-darwin10/build/build-LLVM-host-i686-build_pc-linux-gnu/utils/unittest/googletest'
726[ALL  ]    make[4]: Warning: File `/home/ubuntu/build/crosstool-ng/ct-ng-final/.build/i686-apple-darwin10/build/build-LLVM-host-i686-build_pc-linux-gnu/Makefile.rules' has modification time 0.5 s in the future
727[ALL  ]    make[4]: Leaving directory `/home/ubuntu/build/crosstool-ng/ct-ng-final/.build/i686-apple-darwin10/build/build-LLVM-host-i686-build_pc-linux-gnu/utils/unittest/UnitTestMain'
728[ALL  ]    llvm[4]: Regenerating /home/ubuntu/build/crosstool-ng/ct-ng-final/.build/i686-apple-darwin10/build/build-LLVM-host-i686-build_pc-linux-gnu/Makefile.config
729[ALL  ]    make[4]: Entering directory `/home/ubuntu/build/crosstool-ng/ct-ng-final/.build/i686-apple-darwin10/build/build-LLVM-host-i686-build_pc-linux-gnu/utils/unittest/UnitTestMain'
730[ALL  ]    make[4]: Warning: File `/home/ubuntu/build/crosstool-ng/ct-ng-final/.build/i686-apple-darwin10/build/build-LLVM-host-i686-build_pc-linux-gnu/Makefile.rules' has modification time 0.44 s in the future
731[ALL  ]    llvm[4]: Regenerating /home/ubuntu/build/crosstool-ng/ct-ng-final/.build/i686-apple-darwin10/build/build-LLVM-host-i686-build_pc-linux-gnu/Makefile.config
732[ALL  ]    config.status: creating Makefile.config
733[ALL  ]    make[4]: Leaving directory `/home/ubuntu/build/crosstool-ng/ct-ng-final/.build/i686-apple-darwin10/build/build-LLVM-host-i686-build_pc-linux-gnu/utils/unittest/googletest'
734[ALL  ]    config.status: creating Makefile.config
735[ALL  ]    make[4]: Entering directory `/home/ubuntu/build/crosstool-ng/ct-ng-final/.build/i686-apple-darwin10/build/build-LLVM-host-i686-build_pc-linux-gnu/utils/unittest/googletest'
736[ALL  ]    make[4]: Warning: File `/home/ubuntu/build/crosstool-ng/ct-ng-final/.build/i686-apple-darwin10/build/build-LLVM-host-i686-build_pc-linux-gnu/Makefile.rules' has modification time 0.17 s in the future
737[ALL  ]    llvm[4]: Regenerating /home/ubuntu/build/crosstool-ng/ct-ng-final/.build/i686-apple-darwin10/build/build-LLVM-host-i686-build_pc-linux-gnu/Makefile.config
738[ALL  ]    make[4]: Leaving directory `/home/ubuntu/build/crosstool-ng/ct-ng-final/.build/i686-apple-darwin10/build/build-LLVM-host-i686-build_pc-linux-gnu/utils/unittest/UnitTestMain'
739[ALL  ]    make[4]: Entering directory `/home/ubuntu/build/crosstool-ng/ct-ng-final/.build/i686-apple-darwin10/build/build-LLVM-host-i686-build_pc-linux-gnu/utils/unittest/UnitTestMain'
740[ALL  ]    make[4]: Warning: File `/home/ubuntu/build/crosstool-ng/ct-ng-final/.build/i686-apple-darwin10/build/build-LLVM-host-i686-build_pc-linux-gnu/Makefile.rules' has modification time 0.095 s in the future
741[ALL  ]    llvm[4]: Regenerating /home/ubuntu/build/crosstool-ng/ct-ng-final/.build/i686-apple-darwin10/build/build-LLVM-host-i686-build_pc-linux-gnu/Makefile.config
742[ALL  ]    config.status: creating Makefile.config
743[ALL  ]    make[4]: Leaving directory `/home/ubuntu/build/crosstool-ng/ct-ng-final/.build/i686-apple-darwin10/build/build-LLVM-host-i686-build_pc-linux-gnu/utils/unittest/googletest'
744[ALL  ]    make[4]: Entering directory `/home/ubuntu/build/crosstool-ng/ct-ng-final/.build/i686-apple-darwin10/build/build-LLVM-host-i686-build_pc-linux-gnu/utils/unittest/googletest'
745[ALL  ]    make[4]: Warning: File `/home/ubuntu/build/crosstool-ng/ct-ng-final/.build/i686-apple-darwin10/build/build-LLVM-host-i686-build_pc-linux-gnu/config.status' has modification time 0.062 s in the future
746[ALL  ]    llvm[4]: Regenerating /home/ubuntu/build/crosstool-ng/ct-ng-final/.build/i686-apple-darwin10/build/build-LLVM-host-i686-build_pc-linux-gnu/Makefile.config
747[ALL  ]    config.status: creating Makefile.config
748[ALL  ]    make[4]: Leaving directory `/home/ubuntu/build/crosstool-ng/ct-ng-final/.build/i686-apple-darwin10/build/build-LLVM-host-i686-build_pc-linux-gnu/utils/unittest/UnitTestMain'
749[ALL  ]    make[4]: Entering directory `/home/ubuntu/build/crosstool-ng/ct-ng-final/.build/i686-apple-darwin10/build/build-LLVM-host-i686-build_pc-linux-gnu/utils/unittest/UnitTestMain'
750[ALL  ]    make[4]: Warning: File `/home/ubuntu/build/crosstool-ng/ct-ng-final/.build/i686-apple-darwin10/build/build-LLVM-host-i686-build_pc-linux-gnu/Makefile.rules' has modification time 0.72 s in the future
751[ALL  ]    llvm[4]: Regenerating /home/ubuntu/build/crosstool-ng/ct-ng-final/.build/i686-apple-darwin10/build/build-LLVM-host-i686-build_pc-linux-gnu/Makefile.config
752[ALL  ]    config.status: creating Makefile.config
753[ALL  ]    make[4]: Leaving directory `/home/ubuntu/build/crosstool-ng/ct-ng-final/.build/i686-apple-darwin10/build/build-LLVM-host-i686-build_pc-linux-gnu/utils/unittest/googletest'
754[ALL  ]    make[4]: Entering directory `/home/ubuntu/build/crosstool-ng/ct-ng-final/.build/i686-apple-darwin10/build/build-LLVM-host-i686-build_pc-linux-gnu/utils/unittest/googletest'
755[ALL  ]    make[4]: Warning: File `/home/ubuntu/build/crosstool-ng/ct-ng-final/.build/i686-apple-darwin10/build/build-LLVM-host-i686-build_pc-linux-gnu/Makefile.rules' has modification time 0.54 s in the future
756[ALL  ]    llvm[4]: Regenerating /home/ubuntu/build/crosstool-ng/ct-ng-final/.build/i686-apple-darwin10/build/build-LLVM-host-i686-build_pc-linux-gnu/Makefile.config
757[ALL  ]    config.status: creating Makefile.config
758[ALL  ]    make[4]: Leaving directory `/home/ubuntu/build/crosstool-ng/ct-ng-final/.build/i686-apple-darwin10/build/build-LLVM-host-i686-build_pc-linux-gnu/utils/unittest/UnitTestMain'
759[ALL  ]    config.status: creating Makefile.config
760[ALL  ]    make[4]: Entering directory `/home/ubuntu/build/crosstool-ng/ct-ng-final/.build/i686-apple-darwin10/build/build-LLVM-host-i686-build_pc-linux-gnu/utils/unittest/UnitTestMain'
761[ALL  ]    make[4]: Warning: File `/home/ubuntu/build/crosstool-ng/ct-ng-final/.build/i686-apple-darwin10/build/build-LLVM-host-i686-build_pc-linux-gnu/Makefile.rules' has modification time 0.32 s in the future
762[ALL  ]    llvm[4]: Regenerating /home/ubuntu/build/crosstool-ng/ct-ng-final/.build/i686-apple-darwin10/build/build-LLVM-host-i686-build_pc-linux-gnu/Makefile.config
763[ALL  ]    make[4]: Leaving directory `/home/ubuntu/build/crosstool-ng/ct-ng-final/.build/i686-apple-darwin10/build/build-LLVM-host-i686-build_pc-linux-gnu/utils/unittest/googletest'
764[ALL  ]    make[4]: Entering directory `/home/ubuntu/build/crosstool-ng/ct-ng-final/.build/i686-apple-darwin10/build/build-LLVM-host-i686-build_pc-linux-gnu/utils/unittest/googletest'
765[ALL  ]    make[4]: Warning: File `/home/ubuntu/build/crosstool-ng/ct-ng-final/.build/i686-apple-darwin10/build/build-LLVM-host-i686-build_pc-linux-gnu/Makefile.rules' has modification time 0.23 s in the future
766[ALL  ]    llvm[4]: Regenerating /home/ubuntu/build/crosstool-ng/ct-ng-final/.build/i686-apple-darwin10/build/build-LLVM-host-i686-build_pc-linux-gnu/Makefile.config
767[ALL  ]    llvm[3]: Compiling AsmWriterEmitter.cpp for Release build
768[ALL  ]    config.status: creating Makefile.config
769[ALL  ]    make[4]: Leaving directory `/home/ubuntu/build/crosstool-ng/ct-ng-final/.build/i686-apple-darwin10/build/build-LLVM-host-i686-build_pc-linux-gnu/utils/unittest/UnitTestMain'
770[ALL  ]    config.status: creating Makefile.config
771[ALL  ]    make[4]: Entering directory `/home/ubuntu/build/crosstool-ng/ct-ng-final/.build/i686-apple-darwin10/build/build-LLVM-host-i686-build_pc-linux-gnu/utils/unittest/UnitTestMain'
772[ALL  ]    make[4]: Warning: File `/home/ubuntu/build/crosstool-ng/ct-ng-final/.build/i686-apple-darwin10/build/build-LLVM-host-i686-build_pc-linux-gnu/config.status' has modification time 0.14 s in the future
773[ALL  ]    make[4]: Leaving directory `/home/ubuntu/build/crosstool-ng/ct-ng-final/.build/i686-apple-darwin10/build/build-LLVM-host-i686-build_pc-linux-gnu/utils/unittest/googletest'
774[ALL  ]    llvm[4]: Regenerating /home/ubuntu/build/crosstool-ng/ct-ng-final/.build/i686-apple-darwin10/build/build-LLVM-host-i686-build_pc-linux-gnu/Makefile.config
775[ALL  ]    make[4]: Entering directory `/home/ubuntu/build/crosstool-ng/ct-ng-final/.build/i686-apple-darwin10/build/build-LLVM-host-i686-build_pc-linux-gnu/utils/unittest/googletest'
776[ALL  ]    make[4]: Warning: File `/home/ubuntu/build/crosstool-ng/ct-ng-final/.build/i686-apple-darwin10/build/build-LLVM-host-i686-build_pc-linux-gnu/config.status' has modification time 0.094 s in the future
777[ALL  ]    llvm[4]: Regenerating /home/ubuntu/build/crosstool-ng/ct-ng-final/.build/i686-apple-darwin10/build/build-LLVM-host-i686-build_pc-linux-gnu/Makefile.config
778[ALL  ]    config.status: creating Makefile.config
779[ALL  ]    make[4]: Leaving directory `/home/ubuntu/build/crosstool-ng/ct-ng-final/.build/i686-apple-darwin10/build/build-LLVM-host-i686-build_pc-linux-gnu/utils/unittest/googletest'
780[ALL  ]    config.status: creating Makefile.config
781[ALL  ]    make[4]: Entering directory `/home/ubuntu/build/crosstool-ng/ct-ng-final/.build/i686-apple-darwin10/build/build-LLVM-host-i686-build_pc-linux-gnu/utils/unittest/googletest'
782[ALL  ]    make[4]: Warning: File `/home/ubuntu/build/crosstool-ng/ct-ng-final/.build/i686-apple-darwin10/build/build-LLVM-host-i686-build_pc-linux-gnu/Makefile.rules' has modification time 0.62 s in the future
783[ALL  ]    llvm[4]: Regenerating /home/ubuntu/build/crosstool-ng/ct-ng-final/.build/i686-apple-darwin10/build/build-LLVM-host-i686-build_pc-linux-gnu/Makefile.config
784[ALL  ]    make[4]: Leaving directory `/home/ubuntu/build/crosstool-ng/ct-ng-final/.build/i686-apple-darwin10/build/build-LLVM-host-i686-build_pc-linux-gnu/utils/unittest/UnitTestMain'
785[ALL  ]    make[4]: Entering directory `/home/ubuntu/build/crosstool-ng/ct-ng-final/.build/i686-apple-darwin10/build/build-LLVM-host-i686-build_pc-linux-gnu/utils/unittest/UnitTestMain'
786[ALL  ]    make[4]: Warning: File `/home/ubuntu/build/crosstool-ng/ct-ng-final/.build/i686-apple-darwin10/build/build-LLVM-host-i686-build_pc-linux-gnu/Makefile.rules' has modification time 0.56 s in the future
787[ALL  ]    llvm[4]: Regenerating /home/ubuntu/build/crosstool-ng/ct-ng-final/.build/i686-apple-darwin10/build/build-LLVM-host-i686-build_pc-linux-gnu/Makefile.config
788[ALL  ]    config.status: creating Makefile.config
789[ALL  ]    make[4]: Leaving directory `/home/ubuntu/build/crosstool-ng/ct-ng-final/.build/i686-apple-darwin10/build/build-LLVM-host-i686-build_pc-linux-gnu/utils/unittest/googletest'
790[ALL  ]    make[4]: Entering directory `/home/ubuntu/build/crosstool-ng/ct-ng-final/.build/i686-apple-darwin10/build/build-LLVM-host-i686-build_pc-linux-gnu/utils/unittest/googletest'
791[ALL  ]    make[4]: Warning: File `/home/ubuntu/build/crosstool-ng/ct-ng-final/.build/i686-apple-darwin10/build/build-LLVM-host-i686-build_pc-linux-gnu/Makefile.rules' has modification time 0.32 s in the future
792[ALL  ]    llvm[4]: Regenerating /home/ubuntu/build/crosstool-ng/ct-ng-final/.build/i686-apple-darwin10/build/build-LLVM-host-i686-build_pc-linux-gnu/Makefile.config
793[ALL  ]    config.status: creating Makefile.config
794[ALL  ]    make[4]: Leaving directory `/home/ubuntu/build/crosstool-ng/ct-ng-final/.build/i686-apple-darwin10/build/build-LLVM-host-i686-build_pc-linux-gnu/utils/unittest/UnitTestMain'
795[ALL  ]    make[4]: Entering directory `/home/ubuntu/build/crosstool-ng/ct-ng-final/.build/i686-apple-darwin10/build/build-LLVM-host-i686-build_pc-linux-gnu/utils/unittest/UnitTestMain'
796[ALL  ]    make[4]: Warning: File `/home/ubuntu/build/crosstool-ng/ct-ng-final/.build/i686-apple-darwin10/build/build-LLVM-host-i686-build_pc-linux-gnu/Makefile.rules' has modification time 0.21 s in the future
797[ALL  ]    llvm[4]: Regenerating /home/ubuntu/build/crosstool-ng/ct-ng-final/.build/i686-apple-darwin10/build/build-LLVM-host-i686-build_pc-linux-gnu/Makefile.config
798[ALL  ]    config.status: creating Makefile.config
799[ALL  ]    config.status: creating Makefile.config
800[ALL  ]    make[4]: Leaving directory `/home/ubuntu/build/crosstool-ng/ct-ng-final/.build/i686-apple-darwin10/build/build-LLVM-host-i686-build_pc-linux-gnu/utils/unittest/googletest'
801[ALL  ]    make[4]: Entering directory `/home/ubuntu/build/crosstool-ng/ct-ng-final/.build/i686-apple-darwin10/build/build-LLVM-host-i686-build_pc-linux-gnu/utils/unittest/googletest'
802[ALL  ]    Makefile:12: ../../../Makefile.config: No such file or directory
803[ALL  ]    ../../../Makefile.common:61: ../../../Makefile.config: No such file or directory
804[ALL  ]    ../../../Makefile.common:69: /Makefile.rules: No such file or directory
805[ALL  ]    make[4]: *** No rule to make target `/Makefile.rules'.  Stop.
806[ALL  ]    make[4]: Leaving directory `/home/ubuntu/build/crosstool-ng/ct-ng-final/.build/i686-apple-darwin10/build/build-LLVM-host-i686-build_pc-linux-gnu/utils/unittest/googletest'
807[ERROR]    make[3]: *** [googletest/.makeall] Error 2
808[ALL  ]    make[3]: *** Waiting for unfinished jobs....
809[ALL  ]    llvm[3]: Compiling AsmWriterInst.cpp for Release build
810[ALL  ]    make[4]: Leaving directory `/home/ubuntu/build/crosstool-ng/ct-ng-final/.build/i686-apple-darwin10/build/build-LLVM-host-i686-build_pc-linux-gnu/utils/unittest/UnitTestMain'
811[ALL  ]    make[4]: Entering directory `/home/ubuntu/build/crosstool-ng/ct-ng-final/.build/i686-apple-darwin10/build/build-LLVM-host-i686-build_pc-linux-gnu/utils/unittest/UnitTestMain'
812[ALL  ]    make[4]: Warning: File `/home/ubuntu/build/crosstool-ng/ct-ng-final/.build/i686-apple-darwin10/build/build-LLVM-host-i686-build_pc-linux-gnu/Makefile.rules' has modification time 0.78 s in the future
813[ALL  ]    llvm[4]: Regenerating /home/ubuntu/build/crosstool-ng/ct-ng-final/.build/i686-apple-darwin10/build/build-LLVM-host-i686-build_pc-linux-gnu/Makefile.config
814[ALL  ]    config.status: creating Makefile.config
815[ALL  ]    make[4]: Leaving directory `/home/ubuntu/build/crosstool-ng/ct-ng-final/.build/i686-apple-darwin10/build/build-LLVM-host-i686-build_pc-linux-gnu/utils/unittest/UnitTestMain'
816[ALL  ]    make[4]: Entering directory `/home/ubuntu/build/crosstool-ng/ct-ng-final/.build/i686-apple-darwin10/build/build-LLVM-host-i686-build_pc-linux-gnu/utils/unittest/UnitTestMain'
817[ALL  ]    make[4]: Warning: File `/home/ubuntu/build/crosstool-ng/ct-ng-final/.build/i686-apple-darwin10/build/build-LLVM-host-i686-build_pc-linux-gnu/Makefile.rules' has modification time 0.8 s in the future
818[ALL  ]    llvm[4]: Regenerating /home/ubuntu/build/crosstool-ng/ct-ng-final/.build/i686-apple-darwin10/build/build-LLVM-host-i686-build_pc-linux-gnu/Makefile.config
819[ALL  ]    llvm[3]: Compiling CallingConvEmitter.cpp for Release build
820[ALL  ]    config.status: creating Makefile.config
821[ALL  ]    make[4]: Leaving directory `/home/ubuntu/build/crosstool-ng/ct-ng-final/.build/i686-apple-darwin10/build/build-LLVM-host-i686-build_pc-linux-gnu/utils/unittest/UnitTestMain'
822[ALL  ]    make[4]: Entering directory `/home/ubuntu/build/crosstool-ng/ct-ng-final/.build/i686-apple-darwin10/build/build-LLVM-host-i686-build_pc-linux-gnu/utils/unittest/UnitTestMain'
823[ALL  ]    make[4]: Warning: File `/home/ubuntu/build/crosstool-ng/ct-ng-final/.build/i686-apple-darwin10/build/build-LLVM-host-i686-build_pc-linux-gnu/config.status' has modification time 0.021 s in the future
824[ALL  ]    llvm[4]: Regenerating /home/ubuntu/build/crosstool-ng/ct-ng-final/.build/i686-apple-darwin10/build/build-LLVM-host-i686-build_pc-linux-gnu/Makefile.config
825[ALL  ]    config.status: creating Makefile.config
826[ALL  ]    make[4]: Leaving directory `/home/ubuntu/build/crosstool-ng/ct-ng-final/.build/i686-apple-darwin10/build/build-LLVM-host-i686-build_pc-linux-gnu/utils/unittest/UnitTestMain'
827[ALL  ]    llvm[3]: Compiling ClangDiagnosticsEmitter.cpp for Release build
828[ALL  ]    make[4]: Entering directory `/home/ubuntu/build/crosstool-ng/ct-ng-final/.build/i686-apple-darwin10/build/build-LLVM-host-i686-build_pc-linux-gnu/utils/unittest/UnitTestMain'
829[ALL  ]    make[4]: Warning: File `/home/ubuntu/build/crosstool-ng/ct-ng-final/.build/i686-apple-darwin10/build/build-LLVM-host-i686-build_pc-linux-gnu/config.status' has modification time 0.069 s in the future
830[ALL  ]    llvm[4]: Regenerating /home/ubuntu/build/crosstool-ng/ct-ng-final/.build/i686-apple-darwin10/build/build-LLVM-host-i686-build_pc-linux-gnu/Makefile.config
831[ALL  ]    llvm[3]: Compiling CodeEmitterGen.cpp for Release build
832[ALL  ]    config.status: creating Makefile.config
833[ALL  ]    make[4]: Leaving directory `/home/ubuntu/build/crosstool-ng/ct-ng-final/.build/i686-apple-darwin10/build/build-LLVM-host-i686-build_pc-linux-gnu/utils/unittest/UnitTestMain'
834[ALL  ]    make[4]: Entering directory `/home/ubuntu/build/crosstool-ng/ct-ng-final/.build/i686-apple-darwin10/build/build-LLVM-host-i686-build_pc-linux-gnu/utils/unittest/UnitTestMain'
835[ALL  ]    make[4]: Warning: File `/home/ubuntu/build/crosstool-ng/ct-ng-final/.build/i686-apple-darwin10/build/build-LLVM-host-i686-build_pc-linux-gnu/config.status' has modification time 0.11 s in the future
836[ALL  ]    llvm[4]: Regenerating /home/ubuntu/build/crosstool-ng/ct-ng-final/.build/i686-apple-darwin10/build/build-LLVM-host-i686-build_pc-linux-gnu/Makefile.config
837[ALL  ]    config.status: creating Makefile.config
838[ALL  ]    llvm[3]: Compiling CodeGenDAGPatterns.cpp for Release build
839[ALL  ]    make[4]: Leaving directory `/home/ubuntu/build/crosstool-ng/ct-ng-final/.build/i686-apple-darwin10/build/build-LLVM-host-i686-build_pc-linux-gnu/utils/unittest/UnitTestMain'
840[ALL  ]    make[4]: Entering directory `/home/ubuntu/build/crosstool-ng/ct-ng-final/.build/i686-apple-darwin10/build/build-LLVM-host-i686-build_pc-linux-gnu/utils/unittest/UnitTestMain'
841[ALL  ]    make[4]: Warning: File `/home/ubuntu/build/crosstool-ng/ct-ng-final/.build/i686-apple-darwin10/build/build-LLVM-host-i686-build_pc-linux-gnu/Makefile.rules' has modification time 0.0029 s in the future
842[ALL  ]    llvm[4]: Regenerating /home/ubuntu/build/crosstool-ng/ct-ng-final/.build/i686-apple-darwin10/build/build-LLVM-host-i686-build_pc-linux-gnu/Makefile.config
843[ALL  ]    llvm[3]: Compiling CodeGenInstruction.cpp for Release build
844[ALL  ]    config.status: creating Makefile.config
845[ALL  ]    make[4]: Leaving directory `/home/ubuntu/build/crosstool-ng/ct-ng-final/.build/i686-apple-darwin10/build/build-LLVM-host-i686-build_pc-linux-gnu/utils/unittest/UnitTestMain'
846[ALL  ]    make[4]: Entering directory `/home/ubuntu/build/crosstool-ng/ct-ng-final/.build/i686-apple-darwin10/build/build-LLVM-host-i686-build_pc-linux-gnu/utils/unittest/UnitTestMain'
847[ALL  ]    make[4]: Warning: File `/home/ubuntu/build/crosstool-ng/ct-ng-final/.build/i686-apple-darwin10/build/build-LLVM-host-i686-build_pc-linux-gnu/Makefile.rules' has modification time 0.051 s in the future
848[ALL  ]    llvm[4]: Regenerating /home/ubuntu/build/crosstool-ng/ct-ng-final/.build/i686-apple-darwin10/build/build-LLVM-host-i686-build_pc-linux-gnu/Makefile.config
849[ALL  ]    config.status: creating Makefile.config
850[ALL  ]    make[4]: Leaving directory `/home/ubuntu/build/crosstool-ng/ct-ng-final/.build/i686-apple-darwin10/build/build-LLVM-host-i686-build_pc-linux-gnu/utils/unittest/UnitTestMain'
851[ALL  ]    make[4]: Entering directory `/home/ubuntu/build/crosstool-ng/ct-ng-final/.build/i686-apple-darwin10/build/build-LLVM-host-i686-build_pc-linux-gnu/utils/unittest/UnitTestMain'
852[ALL  ]    make[4]: Warning: File `/home/ubuntu/build/crosstool-ng/ct-ng-final/.build/i686-apple-darwin10/build/build-LLVM-host-i686-build_pc-linux-gnu/Makefile.rules' has modification time 0.087 s in the future
853[ALL  ]    llvm[4]: Regenerating /home/ubuntu/build/crosstool-ng/ct-ng-final/.build/i686-apple-darwin10/build/build-LLVM-host-i686-build_pc-linux-gnu/Makefile.config
854[ALL  ]    config.status: creating Makefile.config
855[ALL  ]    make[4]: Leaving directory `/home/ubuntu/build/crosstool-ng/ct-ng-final/.build/i686-apple-darwin10/build/build-LLVM-host-i686-build_pc-linux-gnu/utils/unittest/UnitTestMain'
856[ALL  ]    make[4]: Entering directory `/home/ubuntu/build/crosstool-ng/ct-ng-final/.build/i686-apple-darwin10/build/build-LLVM-host-i686-build_pc-linux-gnu/utils/unittest/UnitTestMain'
857[ALL  ]    make[4]: Warning: File `/home/ubuntu/build/crosstool-ng/ct-ng-final/.build/i686-apple-darwin10/build/build-LLVM-host-i686-build_pc-linux-gnu/Makefile.rules' has modification time 0.087 s in the future
858[ALL  ]    llvm[4]: Regenerating /home/ubuntu/build/crosstool-ng/ct-ng-final/.build/i686-apple-darwin10/build/build-LLVM-host-i686-build_pc-linux-gnu/Makefile.config
859[ALL  ]    llvm[3]: Compiling CodeGenTarget.cpp for Release build
860[ALL  ]    config.status: creating Makefile.config
861[ALL  ]    make[4]: Leaving directory `/home/ubuntu/build/crosstool-ng/ct-ng-final/.build/i686-apple-darwin10/build/build-LLVM-host-i686-build_pc-linux-gnu/utils/unittest/UnitTestMain'
862[ALL  ]    make[4]: Entering directory `/home/ubuntu/build/crosstool-ng/ct-ng-final/.build/i686-apple-darwin10/build/build-LLVM-host-i686-build_pc-linux-gnu/utils/unittest/UnitTestMain'
863[ALL  ]    make[4]: Warning: File `/home/ubuntu/build/crosstool-ng/ct-ng-final/.build/i686-apple-darwin10/build/build-LLVM-host-i686-build_pc-linux-gnu/Makefile.rules' has modification time 0.11 s in the future
864[ALL  ]    llvm[4]: Regenerating /home/ubuntu/build/crosstool-ng/ct-ng-final/.build/i686-apple-darwin10/build/build-LLVM-host-i686-build_pc-linux-gnu/Makefile.config
865[ALL  ]    config.status: creating Makefile.config
866[ALL  ]    make[4]: Leaving directory `/home/ubuntu/build/crosstool-ng/ct-ng-final/.build/i686-apple-darwin10/build/build-LLVM-host-i686-build_pc-linux-gnu/utils/unittest/UnitTestMain'
867[ALL  ]    make[4]: Entering directory `/home/ubuntu/build/crosstool-ng/ct-ng-final/.build/i686-apple-darwin10/build/build-LLVM-host-i686-build_pc-linux-gnu/utils/unittest/UnitTestMain'
868[ALL  ]    make[4]: Warning: File `/home/ubuntu/build/crosstool-ng/ct-ng-final/.build/i686-apple-darwin10/build/build-LLVM-host-i686-build_pc-linux-gnu/Makefile.rules' has modification time 0.12 s in the future
869[ALL  ]    llvm[4]: Regenerating /home/ubuntu/build/crosstool-ng/ct-ng-final/.build/i686-apple-darwin10/build/build-LLVM-host-i686-build_pc-linux-gnu/Makefile.config
870[ALL  ]    config.status: creating Makefile.config
871[ALL  ]    make[4]: Leaving directory `/home/ubuntu/build/crosstool-ng/ct-ng-final/.build/i686-apple-darwin10/build/build-LLVM-host-i686-build_pc-linux-gnu/utils/unittest/UnitTestMain'
872[ALL  ]    make[4]: Entering directory `/home/ubuntu/build/crosstool-ng/ct-ng-final/.build/i686-apple-darwin10/build/build-LLVM-host-i686-build_pc-linux-gnu/utils/unittest/UnitTestMain'
873[ALL  ]    make[4]: Warning: File `/home/ubuntu/build/crosstool-ng/ct-ng-final/.build/i686-apple-darwin10/build/build-LLVM-host-i686-build_pc-linux-gnu/Makefile.rules' has modification time 0.099 s in the future
874[ALL  ]    llvm[4]: Regenerating /home/ubuntu/build/crosstool-ng/ct-ng-final/.build/i686-apple-darwin10/build/build-LLVM-host-i686-build_pc-linux-gnu/Makefile.config
875[ALL  ]    config.status: creating Makefile.config
876[ALL  ]    make[4]: Leaving directory `/home/ubuntu/build/crosstool-ng/ct-ng-final/.build/i686-apple-darwin10/build/build-LLVM-host-i686-build_pc-linux-gnu/utils/unittest/UnitTestMain'
877[ALL  ]    make[4]: Entering directory `/home/ubuntu/build/crosstool-ng/ct-ng-final/.build/i686-apple-darwin10/build/build-LLVM-host-i686-build_pc-linux-gnu/utils/unittest/UnitTestMain'
878[ALL  ]    make[4]: Warning: File `/home/ubuntu/build/crosstool-ng/ct-ng-final/.build/i686-apple-darwin10/build/build-LLVM-host-i686-build_pc-linux-gnu/Makefile.rules' has modification time 0.039 s in the future
879[ALL  ]    llvm[4]: Regenerating /home/ubuntu/build/crosstool-ng/ct-ng-final/.build/i686-apple-darwin10/build/build-LLVM-host-i686-build_pc-linux-gnu/Makefile.config
880[ALL  ]    config.status: creating Makefile.config
881[ALL  ]    make[4]: Leaving directory `/home/ubuntu/build/crosstool-ng/ct-ng-final/.build/i686-apple-darwin10/build/build-LLVM-host-i686-build_pc-linux-gnu/utils/unittest/UnitTestMain'
882[ALL  ]    make[4]: Entering directory `/home/ubuntu/build/crosstool-ng/ct-ng-final/.build/i686-apple-darwin10/build/build-LLVM-host-i686-build_pc-linux-gnu/utils/unittest/UnitTestMain'
883[ALL  ]    make[4]: Warning: File `/home/ubuntu/build/crosstool-ng/ct-ng-final/.build/i686-apple-darwin10/build/build-LLVM-host-i686-build_pc-linux-gnu/Makefile.rules' has modification time 0.011 s in the future
884[ALL  ]    llvm[4]: Regenerating /home/ubuntu/build/crosstool-ng/ct-ng-final/.build/i686-apple-darwin10/build/build-LLVM-host-i686-build_pc-linux-gnu/Makefile.config
885[ALL  ]    llvm[3]: Compiling DAGISelEmitter.cpp for Release build
886[ALL  ]    llvm[3]: Compiling DAGISelMatcher.cpp for Release build
887[ALL  ]    config.status: creating Makefile.config
888[ALL  ]    make[4]: Leaving directory `/home/ubuntu/build/crosstool-ng/ct-ng-final/.build/i686-apple-darwin10/build/build-LLVM-host-i686-build_pc-linux-gnu/utils/unittest/UnitTestMain'
889[ALL  ]    make[4]: Entering directory `/home/ubuntu/build/crosstool-ng/ct-ng-final/.build/i686-apple-darwin10/build/build-LLVM-host-i686-build_pc-linux-gnu/utils/unittest/UnitTestMain'
890[ALL  ]    make[4]: Warning: File `/home/ubuntu/build/crosstool-ng/ct-ng-final/.build/i686-apple-darwin10/build/build-LLVM-host-i686-build_pc-linux-gnu/Makefile.rules' has modification time 0.087 s in the future
891[ALL  ]    llvm[4]: Regenerating /home/ubuntu/build/crosstool-ng/ct-ng-final/.build/i686-apple-darwin10/build/build-LLVM-host-i686-build_pc-linux-gnu/Makefile.config
892[ALL  ]    config.status: creating Makefile.config
893[ALL  ]    make[4]: Leaving directory `/home/ubuntu/build/crosstool-ng/ct-ng-final/.build/i686-apple-darwin10/build/build-LLVM-host-i686-build_pc-linux-gnu/utils/unittest/UnitTestMain'
894[ALL  ]    make[4]: Entering directory `/home/ubuntu/build/crosstool-ng/ct-ng-final/.build/i686-apple-darwin10/build/build-LLVM-host-i686-build_pc-linux-gnu/utils/unittest/UnitTestMain'
895[ALL  ]    make[4]: Warning: File `/home/ubuntu/build/crosstool-ng/ct-ng-final/.build/i686-apple-darwin10/build/build-LLVM-host-i686-build_pc-linux-gnu/Makefile.rules' has modification time 0.075 s in the future
896[ALL  ]    llvm[4]: Regenerating /home/ubuntu/build/crosstool-ng/ct-ng-final/.build/i686-apple-darwin10/build/build-LLVM-host-i686-build_pc-linux-gnu/Makefile.config
897[ALL  ]    llvm[3]: Compiling DAGISelMatcherEmitter.cpp for Release build
898[ALL  ]    config.status: creating Makefile.config
899[ALL  ]    make[4]: Leaving directory `/home/ubuntu/build/crosstool-ng/ct-ng-final/.build/i686-apple-darwin10/build/build-LLVM-host-i686-build_pc-linux-gnu/utils/unittest/UnitTestMain'
900[ALL  ]    llvm[3]: Compiling DAGISelMatcherGen.cpp for Release build
901[ALL  ]    make[4]: Entering directory `/home/ubuntu/build/crosstool-ng/ct-ng-final/.build/i686-apple-darwin10/build/build-LLVM-host-i686-build_pc-linux-gnu/utils/unittest/UnitTestMain'
902[ALL  ]    make[4]: Warning: File `/home/ubuntu/build/crosstool-ng/ct-ng-final/.build/i686-apple-darwin10/build/build-LLVM-host-i686-build_pc-linux-gnu/Makefile.rules' has modification time 0.14 s in the future
903[ALL  ]    llvm[4]: Regenerating /home/ubuntu/build/crosstool-ng/ct-ng-final/.build/i686-apple-darwin10/build/build-LLVM-host-i686-build_pc-linux-gnu/Makefile.config
904[ALL  ]    config.status: creating Makefile.config
905[ALL  ]    make[4]: Leaving directory `/home/ubuntu/build/crosstool-ng/ct-ng-final/.build/i686-apple-darwin10/build/build-LLVM-host-i686-build_pc-linux-gnu/utils/unittest/UnitTestMain'
906[ALL  ]    make[4]: Entering directory `/home/ubuntu/build/crosstool-ng/ct-ng-final/.build/i686-apple-darwin10/build/build-LLVM-host-i686-build_pc-linux-gnu/utils/unittest/UnitTestMain'
907[ALL  ]    make[4]: Warning: File `/home/ubuntu/build/crosstool-ng/ct-ng-final/.build/i686-apple-darwin10/build/build-LLVM-host-i686-build_pc-linux-gnu/Makefile.rules' has modification time 0.2 s in the future
908[ALL  ]    llvm[4]: Regenerating /home/ubuntu/build/crosstool-ng/ct-ng-final/.build/i686-apple-darwin10/build/build-LLVM-host-i686-build_pc-linux-gnu/Makefile.config
909[ALL  ]    config.status: creating Makefile.config
910[ALL  ]    make[4]: Leaving directory `/home/ubuntu/build/crosstool-ng/ct-ng-final/.build/i686-apple-darwin10/build/build-LLVM-host-i686-build_pc-linux-gnu/utils/unittest/UnitTestMain'
911[ALL  ]    make[4]: Entering directory `/home/ubuntu/build/crosstool-ng/ct-ng-final/.build/i686-apple-darwin10/build/build-LLVM-host-i686-build_pc-linux-gnu/utils/unittest/UnitTestMain'
912[ALL  ]    make[4]: Warning: File `/home/ubuntu/build/crosstool-ng/ct-ng-final/.build/i686-apple-darwin10/build/build-LLVM-host-i686-build_pc-linux-gnu/Makefile.rules' has modification time 0.21 s in the future
913[ALL  ]    llvm[4]: Regenerating /home/ubuntu/build/crosstool-ng/ct-ng-final/.build/i686-apple-darwin10/build/build-LLVM-host-i686-build_pc-linux-gnu/Makefile.config
914[ALL  ]    llvm[3]: Compiling DAGISelMatcherOpt.cpp for Release build
915[ALL  ]    config.status: creating Makefile.config
916[ALL  ]    make[4]: Leaving directory `/home/ubuntu/build/crosstool-ng/ct-ng-final/.build/i686-apple-darwin10/build/build-LLVM-host-i686-build_pc-linux-gnu/utils/unittest/UnitTestMain'
917[ALL  ]    make[4]: Entering directory `/home/ubuntu/build/crosstool-ng/ct-ng-final/.build/i686-apple-darwin10/build/build-LLVM-host-i686-build_pc-linux-gnu/utils/unittest/UnitTestMain'
918[ALL  ]    make[4]: Warning: File `/home/ubuntu/build/crosstool-ng/ct-ng-final/.build/i686-apple-darwin10/build/build-LLVM-host-i686-build_pc-linux-gnu/Makefile.rules' has modification time 0.18 s in the future
919[ALL  ]    llvm[4]: Regenerating /home/ubuntu/build/crosstool-ng/ct-ng-final/.build/i686-apple-darwin10/build/build-LLVM-host-i686-build_pc-linux-gnu/Makefile.config
920[ALL  ]    config.status: creating Makefile.config
921[ALL  ]    llvm[3]: Compiling DisassemblerEmitter.cpp for Release build
922[ALL  ]    make[4]: Leaving directory `/home/ubuntu/build/crosstool-ng/ct-ng-final/.build/i686-apple-darwin10/build/build-LLVM-host-i686-build_pc-linux-gnu/utils/unittest/UnitTestMain'
923[ALL  ]    make[4]: Entering directory `/home/ubuntu/build/crosstool-ng/ct-ng-final/.build/i686-apple-darwin10/build/build-LLVM-host-i686-build_pc-linux-gnu/utils/unittest/UnitTestMain'
924[ALL  ]    make[4]: Warning: File `/home/ubuntu/build/crosstool-ng/ct-ng-final/.build/i686-apple-darwin10/build/build-LLVM-host-i686-build_pc-linux-gnu/Makefile.rules' has modification time 0.2 s in the future
925[ALL  ]    llvm[4]: Regenerating /home/ubuntu/build/crosstool-ng/ct-ng-final/.build/i686-apple-darwin10/build/build-LLVM-host-i686-build_pc-linux-gnu/Makefile.config
926[ALL  ]    llvm[3]: Compiling EDEmitter.cpp for Release build
927[ALL  ]    config.status: creating Makefile.config
928[ALL  ]    llvm[3]: Compiling FastISelEmitter.cpp for Release build
929[ALL  ]    make[4]: Leaving directory `/home/ubuntu/build/crosstool-ng/ct-ng-final/.build/i686-apple-darwin10/build/build-LLVM-host-i686-build_pc-linux-gnu/utils/unittest/UnitTestMain'
930[ALL  ]    make[4]: Entering directory `/home/ubuntu/build/crosstool-ng/ct-ng-final/.build/i686-apple-darwin10/build/build-LLVM-host-i686-build_pc-linux-gnu/utils/unittest/UnitTestMain'
931[ALL  ]    make[4]: Warning: File `/home/ubuntu/build/crosstool-ng/ct-ng-final/.build/i686-apple-darwin10/build/build-LLVM-host-i686-build_pc-linux-gnu/Makefile.rules' has modification time 0.28 s in the future
932[ALL  ]    llvm[4]: Regenerating /home/ubuntu/build/crosstool-ng/ct-ng-final/.build/i686-apple-darwin10/build/build-LLVM-host-i686-build_pc-linux-gnu/Makefile.config
933[ALL  ]    config.status: creating Makefile.config
934[ALL  ]    make[4]: Leaving directory `/home/ubuntu/build/crosstool-ng/ct-ng-final/.build/i686-apple-darwin10/build/build-LLVM-host-i686-build_pc-linux-gnu/utils/unittest/UnitTestMain'
935[ALL  ]    make[4]: Entering directory `/home/ubuntu/build/crosstool-ng/ct-ng-final/.build/i686-apple-darwin10/build/build-LLVM-host-i686-build_pc-linux-gnu/utils/unittest/UnitTestMain'
936[ALL  ]    make[4]: Warning: File `/home/ubuntu/build/crosstool-ng/ct-ng-final/.build/i686-apple-darwin10/build/build-LLVM-host-i686-build_pc-linux-gnu/Makefile.rules' has modification time 0.31 s in the future
937[ALL  ]    llvm[4]: Regenerating /home/ubuntu/build/crosstool-ng/ct-ng-final/.build/i686-apple-darwin10/build/build-LLVM-host-i686-build_pc-linux-gnu/Makefile.config
938[ALL  ]    config.status: creating Makefile.config
939[ALL  ]    make[4]: Leaving directory `/home/ubuntu/build/crosstool-ng/ct-ng-final/.build/i686-apple-darwin10/build/build-LLVM-host-i686-build_pc-linux-gnu/utils/unittest/UnitTestMain'
940[ALL  ]    make[4]: Entering directory `/home/ubuntu/build/crosstool-ng/ct-ng-final/.build/i686-apple-darwin10/build/build-LLVM-host-i686-build_pc-linux-gnu/utils/unittest/UnitTestMain'
941[ALL  ]    make[4]: Warning: File `/home/ubuntu/build/crosstool-ng/ct-ng-final/.build/i686-apple-darwin10/build/build-LLVM-host-i686-build_pc-linux-gnu/Makefile.rules' has modification time 0.29 s in the future
942[ALL  ]    llvm[4]: Regenerating /home/ubuntu/build/crosstool-ng/ct-ng-final/.build/i686-apple-darwin10/build/build-LLVM-host-i686-build_pc-linux-gnu/Makefile.config
943[ALL  ]    config.status: creating Makefile.config
944[ALL  ]    llvm[3]: Compiling InstrEnumEmitter.cpp for Release build
945[ALL  ]    make[4]: Leaving directory `/home/ubuntu/build/crosstool-ng/ct-ng-final/.build/i686-apple-darwin10/build/build-LLVM-host-i686-build_pc-linux-gnu/utils/unittest/UnitTestMain'
946[ALL  ]    make[4]: Entering directory `/home/ubuntu/build/crosstool-ng/ct-ng-final/.build/i686-apple-darwin10/build/build-LLVM-host-i686-build_pc-linux-gnu/utils/unittest/UnitTestMain'
947[ALL  ]    make[4]: Warning: File `/home/ubuntu/build/crosstool-ng/ct-ng-final/.build/i686-apple-darwin10/build/build-LLVM-host-i686-build_pc-linux-gnu/Makefile.rules' has modification time 0.31 s in the future
948[ALL  ]    llvm[4]: Regenerating /home/ubuntu/build/crosstool-ng/ct-ng-final/.build/i686-apple-darwin10/build/build-LLVM-host-i686-build_pc-linux-gnu/Makefile.config
949[ALL  ]    llvm[3]: Compiling InstrInfoEmitter.cpp for Release build
950[ALL  ]    config.status: creating Makefile.config
951[ALL  ]    llvm[3]: Compiling IntrinsicEmitter.cpp for Release build
952[ALL  ]    make[4]: Leaving directory `/home/ubuntu/build/crosstool-ng/ct-ng-final/.build/i686-apple-darwin10/build/build-LLVM-host-i686-build_pc-linux-gnu/utils/unittest/UnitTestMain'
953[ALL  ]    make[4]: Entering directory `/home/ubuntu/build/crosstool-ng/ct-ng-final/.build/i686-apple-darwin10/build/build-LLVM-host-i686-build_pc-linux-gnu/utils/unittest/UnitTestMain'
954[ALL  ]    make[4]: Warning: File `/home/ubuntu/build/crosstool-ng/ct-ng-final/.build/i686-apple-darwin10/build/build-LLVM-host-i686-build_pc-linux-gnu/Makefile.rules' has modification time 0.36 s in the future
955[ALL  ]    llvm[4]: Regenerating /home/ubuntu/build/crosstool-ng/ct-ng-final/.build/i686-apple-darwin10/build/build-LLVM-host-i686-build_pc-linux-gnu/Makefile.config
956[ALL  ]    config.status: creating Makefile.config
957[ALL  ]    make[4]: Leaving directory `/home/ubuntu/build/crosstool-ng/ct-ng-final/.build/i686-apple-darwin10/build/build-LLVM-host-i686-build_pc-linux-gnu/utils/unittest/UnitTestMain'
958[ALL  ]    make[4]: Entering directory `/home/ubuntu/build/crosstool-ng/ct-ng-final/.build/i686-apple-darwin10/build/build-LLVM-host-i686-build_pc-linux-gnu/utils/unittest/UnitTestMain'
959[ALL  ]    make[4]: Warning: File `/home/ubuntu/build/crosstool-ng/ct-ng-final/.build/i686-apple-darwin10/build/build-LLVM-host-i686-build_pc-linux-gnu/Makefile.rules' has modification time 0.42 s in the future
960[ALL  ]    llvm[4]: Regenerating /home/ubuntu/build/crosstool-ng/ct-ng-final/.build/i686-apple-darwin10/build/build-LLVM-host-i686-build_pc-linux-gnu/Makefile.config
961[ALL  ]    config.status: creating Makefile.config
962[ALL  ]    make[4]: Leaving directory `/home/ubuntu/build/crosstool-ng/ct-ng-final/.build/i686-apple-darwin10/build/build-LLVM-host-i686-build_pc-linux-gnu/utils/unittest/UnitTestMain'
963[ALL  ]    make[4]: Entering directory `/home/ubuntu/build/crosstool-ng/ct-ng-final/.build/i686-apple-darwin10/build/build-LLVM-host-i686-build_pc-linux-gnu/utils/unittest/UnitTestMain'
964[ALL  ]    make[4]: Warning: File `/home/ubuntu/build/crosstool-ng/ct-ng-final/.build/i686-apple-darwin10/build/build-LLVM-host-i686-build_pc-linux-gnu/Makefile.rules' has modification time 0.41 s in the future
965[ALL  ]    llvm[4]: Regenerating /home/ubuntu/build/crosstool-ng/ct-ng-final/.build/i686-apple-darwin10/build/build-LLVM-host-i686-build_pc-linux-gnu/Makefile.config
966[ALL  ]    config.status: creating Makefile.config
967[ALL  ]    make[4]: Leaving directory `/home/ubuntu/build/crosstool-ng/ct-ng-final/.build/i686-apple-darwin10/build/build-LLVM-host-i686-build_pc-linux-gnu/utils/unittest/UnitTestMain'
968[ALL  ]    make[4]: Entering directory `/home/ubuntu/build/crosstool-ng/ct-ng-final/.build/i686-apple-darwin10/build/build-LLVM-host-i686-build_pc-linux-gnu/utils/unittest/UnitTestMain'
969[ALL  ]    make[4]: Warning: File `/home/ubuntu/build/crosstool-ng/ct-ng-final/.build/i686-apple-darwin10/build/build-LLVM-host-i686-build_pc-linux-gnu/Makefile.rules' has modification time 0.3 s in the future
970[ALL  ]    llvm[4]: Regenerating /home/ubuntu/build/crosstool-ng/ct-ng-final/.build/i686-apple-darwin10/build/build-LLVM-host-i686-build_pc-linux-gnu/Makefile.config
971[ALL  ]    llvm[3]: Compiling LLVMCConfigurationEmitter.cpp for Release build
972[ALL  ]    config.status: creating Makefile.config
973[ALL  ]    make[4]: Leaving directory `/home/ubuntu/build/crosstool-ng/ct-ng-final/.build/i686-apple-darwin10/build/build-LLVM-host-i686-build_pc-linux-gnu/utils/unittest/UnitTestMain'
974[ALL  ]    llvm[3]: Compiling OptParserEmitter.cpp for Release build
975[ALL  ]    make[4]: Entering directory `/home/ubuntu/build/crosstool-ng/ct-ng-final/.build/i686-apple-darwin10/build/build-LLVM-host-i686-build_pc-linux-gnu/utils/unittest/UnitTestMain'
976[ALL  ]    make[4]: Warning: File `/home/ubuntu/build/crosstool-ng/ct-ng-final/.build/i686-apple-darwin10/build/build-LLVM-host-i686-build_pc-linux-gnu/Makefile.rules' has modification time 0.43 s in the future
977[ALL  ]    llvm[4]: Regenerating /home/ubuntu/build/crosstool-ng/ct-ng-final/.build/i686-apple-darwin10/build/build-LLVM-host-i686-build_pc-linux-gnu/Makefile.config
978[ALL  ]    config.status: creating Makefile.config
979[ALL  ]    make[4]: Leaving directory `/home/ubuntu/build/crosstool-ng/ct-ng-final/.build/i686-apple-darwin10/build/build-LLVM-host-i686-build_pc-linux-gnu/utils/unittest/UnitTestMain'
980[ALL  ]    make[4]: Entering directory `/home/ubuntu/build/crosstool-ng/ct-ng-final/.build/i686-apple-darwin10/build/build-LLVM-host-i686-build_pc-linux-gnu/utils/unittest/UnitTestMain'
981[ALL  ]    make[4]: Warning: File `/home/ubuntu/build/crosstool-ng/ct-ng-final/.build/i686-apple-darwin10/build/build-LLVM-host-i686-build_pc-linux-gnu/Makefile.rules' has modification time 0.25 s in the future
982[ALL  ]    llvm[4]: Regenerating /home/ubuntu/build/crosstool-ng/ct-ng-final/.build/i686-apple-darwin10/build/build-LLVM-host-i686-build_pc-linux-gnu/Makefile.config
983[ALL  ]    config.status: creating Makefile.config
984[ALL  ]    make[4]: Leaving directory `/home/ubuntu/build/crosstool-ng/ct-ng-final/.build/i686-apple-darwin10/build/build-LLVM-host-i686-build_pc-linux-gnu/utils/unittest/UnitTestMain'
985[ALL  ]    make[4]: Entering directory `/home/ubuntu/build/crosstool-ng/ct-ng-final/.build/i686-apple-darwin10/build/build-LLVM-host-i686-build_pc-linux-gnu/utils/unittest/UnitTestMain'
986[ALL  ]    make[4]: Warning: File `/home/ubuntu/build/crosstool-ng/ct-ng-final/.build/i686-apple-darwin10/build/build-LLVM-host-i686-build_pc-linux-gnu/Makefile.rules' has modification time 0.068 s in the future
987[ALL  ]    llvm[4]: Regenerating /home/ubuntu/build/crosstool-ng/ct-ng-final/.build/i686-apple-darwin10/build/build-LLVM-host-i686-build_pc-linux-gnu/Makefile.config
988[ALL  ]    config.status: creating Makefile.config
989[ALL  ]    make[4]: Leaving directory `/home/ubuntu/build/crosstool-ng/ct-ng-final/.build/i686-apple-darwin10/build/build-LLVM-host-i686-build_pc-linux-gnu/utils/unittest/UnitTestMain'
990[ALL  ]    make[4]: Entering directory `/home/ubuntu/build/crosstool-ng/ct-ng-final/.build/i686-apple-darwin10/build/build-LLVM-host-i686-build_pc-linux-gnu/utils/unittest/UnitTestMain'
991[ALL  ]    make[4]: Warning: File `/home/ubuntu/build/crosstool-ng/ct-ng-final/.build/i686-apple-darwin10/build/build-LLVM-host-i686-build_pc-linux-gnu/config.status' has modification time 0.087 s in the future
992[ALL  ]    llvm[4]: Regenerating /home/ubuntu/build/crosstool-ng/ct-ng-final/.build/i686-apple-darwin10/build/build-LLVM-host-i686-build_pc-linux-gnu/Makefile.config
993[ALL  ]    config.status: creating Makefile.config
994[ALL  ]    make[4]: Leaving directory `/home/ubuntu/build/crosstool-ng/ct-ng-final/.build/i686-apple-darwin10/build/build-LLVM-host-i686-build_pc-linux-gnu/utils/unittest/UnitTestMain'
995[ALL  ]    make[4]: Entering directory `/home/ubuntu/build/crosstool-ng/ct-ng-final/.build/i686-apple-darwin10/build/build-LLVM-host-i686-build_pc-linux-gnu/utils/unittest/UnitTestMain'
996[ALL  ]    make[4]: Warning: File `/home/ubuntu/build/crosstool-ng/ct-ng-final/.build/i686-apple-darwin10/build/build-LLVM-host-i686-build_pc-linux-gnu/Makefile.rules' has modification time 0.71 s in the future
997[ALL  ]    llvm[4]: Regenerating /home/ubuntu/build/crosstool-ng/ct-ng-final/.build/i686-apple-darwin10/build/build-LLVM-host-i686-build_pc-linux-gnu/Makefile.config
998[ALL  ]    config.status: creating Makefile.config
999[ALL  ]    make[4]: Leaving directory `/home/ubuntu/build/crosstool-ng/ct-ng-final/.build/i686-apple-darwin10/build/build-LLVM-host-i686-build_pc-linux-gnu/utils/unittest/UnitTestMain'
1000[ALL  ]    make[4]: Entering directory `/home/ubuntu/build/crosstool-ng/ct-ng-final/.build/i686-apple-darwin10/build/build-LLVM-host-i686-build_pc-linux-gnu/utils/unittest/UnitTestMain'
1001[ALL  ]    make[4]: Warning: File `/home/ubuntu/build/crosstool-ng/ct-ng-final/.build/i686-apple-darwin10/build/build-LLVM-host-i686-build_pc-linux-gnu/Makefile.rules' has modification time 0.53 s in the future
1002[ALL  ]    llvm[4]: Regenerating /home/ubuntu/build/crosstool-ng/ct-ng-final/.build/i686-apple-darwin10/build/build-LLVM-host-i686-build_pc-linux-gnu/Makefile.config
1003[ALL  ]    config.status: creating Makefile.config
1004[ALL  ]    make[4]: Leaving directory `/home/ubuntu/build/crosstool-ng/ct-ng-final/.build/i686-apple-darwin10/build/build-LLVM-host-i686-build_pc-linux-gnu/utils/unittest/UnitTestMain'
1005[ALL  ]    make[4]: Entering directory `/home/ubuntu/build/crosstool-ng/ct-ng-final/.build/i686-apple-darwin10/build/build-LLVM-host-i686-build_pc-linux-gnu/utils/unittest/UnitTestMain'
1006[ALL  ]    make[4]: Warning: File `/home/ubuntu/build/crosstool-ng/ct-ng-final/.build/i686-apple-darwin10/build/build-LLVM-host-i686-build_pc-linux-gnu/Makefile.rules' has modification time 0.36 s in the future
1007[ALL  ]    llvm[4]: Regenerating /home/ubuntu/build/crosstool-ng/ct-ng-final/.build/i686-apple-darwin10/build/build-LLVM-host-i686-build_pc-linux-gnu/Makefile.config
1008[ALL  ]    llvm[3]: Compiling Record.cpp for Release build
1009[ALL  ]    config.status: creating Makefile.config
1010[ALL  ]    make[4]: Leaving directory `/home/ubuntu/build/crosstool-ng/ct-ng-final/.build/i686-apple-darwin10/build/build-LLVM-host-i686-build_pc-linux-gnu/utils/unittest/UnitTestMain'
1011[ALL  ]    make[4]: Entering directory `/home/ubuntu/build/crosstool-ng/ct-ng-final/.build/i686-apple-darwin10/build/build-LLVM-host-i686-build_pc-linux-gnu/utils/unittest/UnitTestMain'
1012[ALL  ]    make[4]: Warning: File `/home/ubuntu/build/crosstool-ng/ct-ng-final/.build/i686-apple-darwin10/build/build-LLVM-host-i686-build_pc-linux-gnu/Makefile.rules' has modification time 0.54 s in the future
1013[ALL  ]    llvm[4]: Regenerating /home/ubuntu/build/crosstool-ng/ct-ng-final/.build/i686-apple-darwin10/build/build-LLVM-host-i686-build_pc-linux-gnu/Makefile.config
1014[ALL  ]    config.status: creating Makefile.config
1015[ALL  ]    make[4]: Leaving directory `/home/ubuntu/build/crosstool-ng/ct-ng-final/.build/i686-apple-darwin10/build/build-LLVM-host-i686-build_pc-linux-gnu/utils/unittest/UnitTestMain'
1016[ALL  ]    make[4]: Entering directory `/home/ubuntu/build/crosstool-ng/ct-ng-final/.build/i686-apple-darwin10/build/build-LLVM-host-i686-build_pc-linux-gnu/utils/unittest/UnitTestMain'
1017[ALL  ]    make[4]: Warning: File `/home/ubuntu/build/crosstool-ng/ct-ng-final/.build/i686-apple-darwin10/build/build-LLVM-host-i686-build_pc-linux-gnu/Makefile.rules' has modification time 0.51 s in the future
1018[ALL  ]    llvm[4]: Compiling TestMain.cpp for Release build
1019  [ALL  ]    llvm[4]: Building Release Archive Library libUnitTestMain.a
1020  [ALL  ]    make[4]: warning:  Clock skew detected.  Your build may be incomplete.
1021  [ALL  ]    make[4]: Leaving directory `/home/ubuntu/build/crosstool-ng/ct-ng-final/.build/i686-apple-darwin10/build/build-LLVM-host-i686-build_pc-linux-gnu/utils/unittest/UnitTestMain'
1022  [ALL  ]    make[3]: Leaving directory `/home/ubuntu/build/crosstool-ng/ct-ng-final/.build/i686-apple-darwin10/build/build-LLVM-host-i686-build_pc-linux-gnu/utils/unittest'
1023  [ERROR]    make[2]: *** [unittest/.makeall] Error 2
1024  [ALL  ]    make[2]: *** Waiting for unfinished jobs....
1025  [ALL  ]    llvm[3]: Compiling RegisterInfoEmitter.cpp for Release build
1026  [ALL  ]    llvm[3]: Compiling SubtargetEmitter.cpp for Release build
1027  [ALL  ]    llvm[3]: Compiling TGLexer.cpp for Release build
1028  [ALL  ]    llvm[3]: Compiling TGParser.cpp for Release build
1029  [ALL  ]    llvm[3]: Compiling TGValueTypes.cpp for Release build
1030  [ALL  ]    llvm[3]: Compiling TableGen.cpp for Release build
1031  [ALL  ]    llvm[3]: Compiling TableGenBackend.cpp for Release build
1032  [ALL  ]    llvm[3]: Compiling X86DisassemblerTables.cpp for Release build
1033  [ALL  ]    llvm[3]: Compiling X86RecognizableInstr.cpp for Release build
1034  [ALL  ]    llvm[3]: Linking Release executable tblgen (without symbols)
1035  [ALL  ]    llvm[3]: ======= Finished Linking Release Executable tblgen (without symbols)
1036  [ALL  ]    make[3]: warning:  Clock skew detected.  Your build may be incomplete.
1037  [ALL  ]    make[3]: Leaving directory `/home/ubuntu/build/crosstool-ng/ct-ng-final/.build/i686-apple-darwin10/build/build-LLVM-host-i686-build_pc-linux-gnu/utils/TableGen'
1038  [ALL  ]    make[2]: Leaving directory `/home/ubuntu/build/crosstool-ng/ct-ng-final/.build/i686-apple-darwin10/build/build-LLVM-host-i686-build_pc-linux-gnu/utils'
1039  [ERROR]    make[1]: *** [all] Error 1
1040  [ALL  ]    make[1]: Leaving directory `/home/ubuntu/build/crosstool-ng/ct-ng-final/.build/i686-apple-darwin10/build/build-LLVM-host-i686-build_pc-linux-gnu'
1041  [ERROR] 
1042  [ERROR]  >>
1043  [ERROR]  >>  Build failed in step 'Installing LLVM for host'
1044  [ERROR]  >>        called in step '(top-level)'
1045  [ERROR]  >>
1046  [ERROR]  >>  Error happened in: CT_DoExecLog[scripts/functions@257]
1047  [ERROR]  >>        called from: do_llvm_backend[scripts/build/companion_libs/150-llvm.sh@144]
1048  [ERROR]  >>        called from: do_llvm_for_host[scripts/build/companion_libs/150-llvm.sh@93]
1049  [ERROR]  >>        called from: do_companion_libs_for_host[scripts/build/companion_libs.sh@36]
1050  [ERROR]  >>        called from: main[scripts/crosstool-NG.sh@656]
1051  [ERROR]  >>
1052  [ERROR]  >>  For more info on this error, look at the file: 'build.log'
1053[ERROR]  >>  There is a list of known issues, some with workarounds, in:
1054[ERROR]  >>      '/usr/local/share/doc/crosstool-ng/ct-ng.hg+unknown-20000101.000000/B - Known issues.txt'
1055[ERROR] 
1056[ERROR]  (elapsed: 0:00.-31)