Ticket #9711: cross_mac_gmp1

File cross_mac_gmp1, 82.8 KB (added by gk, 6 years ago)
Line 
1[INFO ]  Performing some trivial sanity checks
2[DEBUG]  Testing '! ( -n  )'
3[DEBUG]  Testing '! ( -n  )'
4[DEBUG]  Testing '! ( -n  )'
5[DEBUG]  Testing '! ( -n  )'
6[DEBUG]  Testing '! ( -n  )'
7[DEBUG]  Testing '! ( -n  )'
8[DEBUG]  ==> Executing: 'mkdir' '-p' '/home/ubuntu/build/crosstool-ng/ct-ng-final/.build'
9[DEBUG]  ==> Executing: 'rm' '-f' '/home/ubuntu/build/crosstool-ng/ct-ng-final/.build/backtrace'
10[DEBUG]  ==> Executing: 'touch' '/home/ubuntu/build/crosstool-ng/ct-ng-final/.build/foo'
11[DEBUG]  Testing '! ( -f /home/ubuntu/build/crosstool-ng/ct-ng-final/.build/FOO )'
12[DEBUG]  ==> Executing: 'rm' '-f' '/home/ubuntu/build/crosstool-ng/ct-ng-final/.build/foo'
13[DEBUG]  Testing '-f /bin/bash -a -x /bin/bash'
14[DEBUG]  Creating bin-override for tools in '/home/ubuntu/build/crosstool-ng/ct-ng-final/.build/tools'
15[DEBUG]  ==> Executing: 'mkdir' '-p' '/home/ubuntu/build/crosstool-ng/ct-ng-final/.build/tools/bin'
16[DEBUG]  Creating script-override for 'install' -> '"/usr/bin/install -c"'
17[DEBUG]  ==> Executing: 'chmod' '700' '/home/ubuntu/build/crosstool-ng/ct-ng-final/.build/tools/bin/install'
18[DEBUG]  Creating script-override for 'bash' -> '"/bin/bash"'
19[DEBUG]  ==> Executing: 'chmod' '700' '/home/ubuntu/build/crosstool-ng/ct-ng-final/.build/tools/bin/bash'
20[DEBUG]  Creating script-override for 'awk' -> '"/usr/bin/awk"'
21[DEBUG]  ==> Executing: 'chmod' '700' '/home/ubuntu/build/crosstool-ng/ct-ng-final/.build/tools/bin/awk'
22[DEBUG]  Creating script-override for 'grep' -> '"/bin/grep"'
23[DEBUG]  ==> Executing: 'chmod' '700' '/home/ubuntu/build/crosstool-ng/ct-ng-final/.build/tools/bin/grep'
24[DEBUG]  Creating script-override for 'make' -> '"/usr/bin/make"'
25[DEBUG]  ==> Executing: 'chmod' '700' '/home/ubuntu/build/crosstool-ng/ct-ng-final/.build/tools/bin/make'
26[DEBUG]  Creating script-override for 'sed' -> '"/bin/sed"'
27[DEBUG]  ==> Executing: 'chmod' '700' '/home/ubuntu/build/crosstool-ng/ct-ng-final/.build/tools/bin/sed'
28[DEBUG]  Creating script-override for 'libtool' -> '"/usr/bin/libtool"'
29[DEBUG]  ==> Executing: 'chmod' '700' '/home/ubuntu/build/crosstool-ng/ct-ng-final/.build/tools/bin/libtool'
30[DEBUG]  Creating script-override for 'libtoolize' -> '"/usr/bin/libtoolize"'
31[DEBUG]  ==> Executing: 'chmod' '700' '/home/ubuntu/build/crosstool-ng/ct-ng-final/.build/tools/bin/libtoolize'
32[DEBUG]  Creating script-override for 'objcopy' -> '"/usr/bin/objcopy"'
33[DEBUG]  ==> Executing: 'chmod' '700' '/home/ubuntu/build/crosstool-ng/ct-ng-final/.build/tools/bin/objcopy'
34[DEBUG]  Creating script-override for 'objdump' -> '"/usr/bin/objdump"'
35[DEBUG]  ==> Executing: 'chmod' '700' '/home/ubuntu/build/crosstool-ng/ct-ng-final/.build/tools/bin/objdump'
36[DEBUG]  Creating script-override for 'readelf' -> '"/usr/bin/readelf"'
37[DEBUG]  ==> Executing: 'chmod' '700' '/home/ubuntu/build/crosstool-ng/ct-ng-final/.build/tools/bin/readelf'
38[DEBUG]  Creating script-override for 'patch' -> '"/usr/bin/patch"'
39[DEBUG]  ==> Executing: 'chmod' '700' '/home/ubuntu/build/crosstool-ng/ct-ng-final/.build/tools/bin/patch'
40[DEBUG]  Creating script-override for 'gperf' -> '"/usr/bin/gperf"'
41[DEBUG]  ==> Executing: 'chmod' '700' '/home/ubuntu/build/crosstool-ng/ct-ng-final/.build/tools/bin/gperf'
42[INFO ]  Build started 20000101.000000
43[DEBUG]  =================================================================
44[DEBUG]  Dumping user-supplied crosstool-NG configuration
45[DEBUG]    ==> Executing: 'grep' '-E' '^(# |)CT_' '.config'
46[DEBUG]    CT_CONFIGURE_has_xz=y
47[DEBUG]    CT_CONFIGURE_has_svn=y
48[DEBUG]    CT_MODULES=y
49[DEBUG]    # CT_OBSOLETE is not set
50[DEBUG]    CT_EXPERIMENTAL=y
51[DEBUG]    # CT_ALLOW_BUILD_AS_ROOT is not set
52[DEBUG]    # CT_DEBUG_CT is not set
53[DEBUG]    CT_LOCAL_TARBALLS_DIR="${HOME}/src"
54[DEBUG]    CT_SAVE_TARBALLS=y
55[DEBUG]    CT_CUSTOM_LOCATION_ROOT_DIR=""
56[DEBUG]    CT_WORK_DIR="${CT_TOP_DIR}/.build"
57[DEBUG]    CT_PREFIX_DIR="${HOME}/x-tools/${CT_TARGET}"
58[DEBUG]    CT_INSTALL_DIR="${CT_PREFIX_DIR}"
59[DEBUG]    CT_RM_RF_PREFIX_DIR=y
60[DEBUG]    CT_REMOVE_DOCS=y
61[DEBUG]    CT_INSTALL_DIR_RO=y
62[DEBUG]    CT_STRIP_ALL_TOOLCHAIN_EXECUTABLES=y
63[DEBUG]    # CT_FORBID_DOWNLOAD is not set
64[DEBUG]    # CT_FORCE_DOWNLOAD is not set
65[DEBUG]    CT_CONNECT_TIMEOUT=10
66[DEBUG]    # CT_ONLY_DOWNLOAD is not set
67[DEBUG]    # CT_USE_MIRROR is not set
68[DEBUG]    # CT_FORCE_EXTRACT is not set
69[DEBUG]    CT_OVERIDE_CONFIG_GUESS_SUB=y
70[DEBUG]    # CT_ONLY_EXTRACT is not set
71[DEBUG]    CT_PATCH_BUNDLED=y
72[DEBUG]    # CT_PATCH_LOCAL is not set
73[DEBUG]    # CT_PATCH_BUNDLED_LOCAL is not set
74[DEBUG]    # CT_PATCH_LOCAL_BUNDLED is not set
75[DEBUG]    # CT_PATCH_BUNDLED_FALLBACK_LOCAL is not set
76[DEBUG]    # CT_PATCH_LOCAL_FALLBACK_BUNDLED is not set
77[DEBUG]    # CT_PATCH_NONE is not set
78[DEBUG]    CT_PATCH_ORDER="bundled"
79[DEBUG]    CT_PARALLEL_JOBS=0
80[DEBUG]    CT_LOAD=""
81[DEBUG]    CT_USE_PIPES=y
82[DEBUG]    CT_EXTRA_CFLAGS_FOR_BUILD="-m32"
83[DEBUG]    CT_EXTRA_LDFLAGS_FOR_BUILD="-m32"
84[DEBUG]    CT_EXTRA_CFLAGS_FOR_HOST="-m32"
85[DEBUG]    CT_EXTRA_LDFLAGS_FOR_HOST="-m32"
86[DEBUG]    # CT_CONFIG_SHELL_SH is not set
87[DEBUG]    # CT_CONFIG_SHELL_ASH is not set
88[DEBUG]    CT_CONFIG_SHELL_BASH=y
89[DEBUG]    # CT_CONFIG_SHELL_CUSTOM is not set
90[DEBUG]    CT_CONFIG_SHELL="${bash}"
91[DEBUG]    # CT_LOG_ERROR is not set
92[DEBUG]    # CT_LOG_WARN is not set
93[DEBUG]    # CT_LOG_INFO is not set
94[DEBUG]    CT_LOG_EXTRA=y
95[DEBUG]    # CT_LOG_ALL is not set
96[DEBUG]    # CT_LOG_DEBUG is not set
97[DEBUG]    CT_LOG_LEVEL_MAX="EXTRA"
98[DEBUG]    # CT_LOG_SEE_TOOLS_WARN is not set
99[DEBUG]    CT_LOG_PROGRESS_BAR=y
100[DEBUG]    CT_LOG_TO_FILE=y
101[DEBUG]    CT_LOG_FILE_COMPRESS=y
102[DEBUG]    CT_ARCH="x86"
103[DEBUG]    CT_ARCH_SUPPORTS_32=y
104[DEBUG]    CT_ARCH_SUPPORTS_64=y
105[DEBUG]    CT_ARCH_SUPPORTS_WITH_ARCH=y
106[DEBUG]    CT_ARCH_SUPPORTS_WITH_CPU=y
107[DEBUG]    CT_ARCH_SUPPORTS_WITH_TUNE=y
108[DEBUG]    CT_ARCH_DEFAULT_32=y
109[DEBUG]    CT_ARCH_ARCH=""
110[DEBUG]    CT_ARCH_CPU=""
111[DEBUG]    CT_ARCH_TUNE="i686"
112[DEBUG]    CT_ARCH_32=y
113[DEBUG]    # CT_ARCH_64 is not set
114[DEBUG]    CT_ARCH_BITNESS=32
115[DEBUG]    CT_TARGET_CFLAGS=""
116[DEBUG]    CT_TARGET_LDFLAGS=""
117[DEBUG]    # CT_ARCH_alpha is not set
118[DEBUG]    # CT_ARCH_arm is not set
119[DEBUG]    # CT_ARCH_avr32 is not set
120[DEBUG]    # CT_ARCH_blackfin is not set
121[DEBUG]    # CT_ARCH_m68k is not set
122[DEBUG]    # CT_ARCH_microblaze is not set
123[DEBUG]    # CT_ARCH_mips is not set
124[DEBUG]    # CT_ARCH_powerpc is not set
125[DEBUG]    # CT_ARCH_s390 is not set
126[DEBUG]    # CT_ARCH_sh is not set
127[DEBUG]    # CT_ARCH_sparc is not set
128[DEBUG]    CT_ARCH_x86=y
129[DEBUG]    CT_ARCH_alpha_AVAILABLE=y
130[DEBUG]    CT_ARCH_arm_AVAILABLE=y
131[DEBUG]    CT_ARCH_avr32_AVAILABLE=y
132[DEBUG]    CT_ARCH_blackfin_AVAILABLE=y
133[DEBUG]    CT_ARCH_m68k_AVAILABLE=y
134[DEBUG]    CT_ARCH_microblaze_AVAILABLE=y
135[DEBUG]    CT_ARCH_mips_AVAILABLE=y
136[DEBUG]    CT_ARCH_powerpc_AVAILABLE=y
137[DEBUG]    CT_ARCH_s390_AVAILABLE=y
138[DEBUG]    CT_ARCH_sh_AVAILABLE=y
139[DEBUG]    CT_ARCH_sparc_AVAILABLE=y
140[DEBUG]    CT_ARCH_x86_AVAILABLE=y
141[DEBUG]    CT_ARCH_SUFFIX=""
142[DEBUG]    CT_MULTILIB=y
143[DEBUG]    CT_ARCH_USE_MMU=y
144[DEBUG]    CT_ARCH_32=y
145[DEBUG]    CT_ARCH_FLOAT=""
146[DEBUG]    CT_FORCE_SYSROOT=y
147[DEBUG]    CT_USE_SYSROOT=y
148[DEBUG]    CT_SYSROOT_NAME="sysroot"
149[DEBUG]    CT_SYSROOT_DIR_PREFIX=""
150[DEBUG]    # CT_STATIC_TOOLCHAIN is not set
151[DEBUG]    CT_TOOLCHAIN_PKGVERSION=""
152[DEBUG]    CT_TOOLCHAIN_BUGURL=""
153[DEBUG]    CT_TARGET_VENDOR="apple"
154[DEBUG]    CT_TARGET_ALIAS_SED_EXPR=""
155[DEBUG]    CT_TARGET_ALIAS=""
156[DEBUG]    # CT_NATIVE is not set
157[DEBUG]    CT_CROSS=y
158[DEBUG]    # CT_CROSS_NATIVE is not set
159[DEBUG]    # CT_CANADIAN is not set
160[DEBUG]    CT_TOOLCHAIN_TYPE="cross"
161[DEBUG]    CT_BUILD=""
162[DEBUG]    CT_BUILD_PREFIX=""
163[DEBUG]    CT_BUILD_SUFFIX=""
164[DEBUG]    # CT_TOOLCHAIN_ENABLE_NLS is not set
165[DEBUG]    # CT_DARWIN_COPY_SDK_TO_SYSROOT is not set
166[DEBUG]    CT_DARWIN=y
167[DEBUG]    CT_KERNEL_SUPPORTS_SHARED_LIBS=y
168[DEBUG]    CT_KERNEL="darwin"
169[DEBUG]    # CT_KERNEL_bare_metal is not set
170[DEBUG]    CT_KERNEL_darwin=y
171[DEBUG]    # CT_KERNEL_linux is not set
172[DEBUG]    # CT_KERNEL_mingw32 is not set
173[DEBUG]    # CT_KERNEL_windows is not set
174[DEBUG]    CT_KERNEL_bare_metal_AVAILABLE=y
175[DEBUG]    CT_KERNEL_darwin_AVAILABLE=y
176[DEBUG]    # CT_DARWIN_MAC_OSX_V_10_7 is not set
177[DEBUG]    CT_DARWIN_MAC_OSX_V_10_6=y
178[DEBUG]    # CT_DARWIN_IOS_V_5_0 is not set
179[DEBUG]    # CT_DARWIN_IOS_V_6_0 is not set
180[DEBUG]    # CT_DARWIN_IOS_V_6_1 is not set
181[DEBUG]    CT_DARWIN_VERSION="10"
182[DEBUG]    CT_DARWIN_SDK_PATH="${HOME}/MacOSX10.6.sdk"
183[DEBUG]    CT_DARWIN_SDK="MacOSX10.6.sdk"
184[DEBUG]    CT_KERNEL_linux_AVAILABLE=y
185[DEBUG]    CT_KERNEL_mingw32_AVAILABLE=y
186[DEBUG]    CT_KERNEL_windows_AVAILABLE=y
187[DEBUG]    CT_SHARED_LIBS=y
188[DEBUG]    CT_ARCH_BINFMT_MACH_O=y
189[DEBUG]    CT_BINUTILS="cctools"
190[DEBUG]    CT_BINUTILS_cctools=y
191[DEBUG]    CT_BINUTILS_VERSION="809"
192[DEBUG]    CT_CCTOOLS_V_809=y
193[DEBUG]    # CT_CCTOOLS_V_806 is not set
194[DEBUG]    # CT_CC_clang is not set
195[DEBUG]    CT_CC_gcc=y
196[DEBUG]    CT_CC_GCC_V_apple_5666_3=y
197[DEBUG]    CT_CC_GCC_APPLE=y
198[DEBUG]    # CT_CC_GCC_USE_GRAPHITE is not set
199[DEBUG]    # CT_CC_GCC_USE_LTO is not set
200[DEBUG]    CT_CC_GCC_VERSION="5666.3"
201[DEBUG]    # CT_CC_LANG_FORTRAN is not set
202[DEBUG]    CT_CC_GCC_ENABLE_CXX_FLAGS=""
203[DEBUG]    CT_CC_GCC_CORE_EXTRA_CONFIG_ARRAY=""
204[DEBUG]    CT_CC_GCC_EXTRA_CONFIG_ARRAY=""
205[DEBUG]    # CT_CC_GCC_SYSTEM_ZLIB is not set
206[DEBUG]    CT_CC_GCC_ENABLE_TARGET_OPTSPACE=y
207[DEBUG]    # CT_CC_GCC_LIBMUDFLAP is not set
208[DEBUG]    # CT_CC_GCC_LIBGOMP is not set
209[DEBUG]    # CT_CC_GCC_LIBSSP is not set
210[DEBUG]    CT_CC_CXA_ATEXIT=y
211[DEBUG]    # CT_CC_GCC_DISABLE_PCH is not set
212[DEBUG]    CT_CC_GCC_SJLJ_EXCEPTIONS=m
213[DEBUG]    # CT_CC_llvmgcc is not set
214[DEBUG]    CT_CC_SUPPORT_CXX=y
215[DEBUG]    CT_CC_SUPPORT_FORTRAN=y
216[DEBUG]    CT_CC_SUPPORT_JAVA=y
217[DEBUG]    CT_CC_SUPPORT_ADA=y
218[DEBUG]    CT_CC_SUPPORT_OBJC=y
219[DEBUG]    CT_CC_SUPPORT_OBJCXX=y
220[DEBUG]    CT_CC_LANG_CXX=y
221[DEBUG]    # CT_CC_LANG_JAVA is not set
222[DEBUG]    # CT_CC_LANG_ADA is not set
223[DEBUG]    CT_CC_LANG_OBJC=y
224[DEBUG]    CT_CC_LANG_OBJCXX=y
225[DEBUG]    CT_CC_LANG_OTHERS=""
226[DEBUG]    CT_LIBC="none"
227[DEBUG]    CT_LIBC_none=y
228[DEBUG]    CT_LIBC_eglibc_AVAILABLE=y
229[DEBUG]    CT_LIBC_glibc_AVAILABLE=y
230[DEBUG]    CT_LIBC_mingw_AVAILABLE=y
231[DEBUG]    CT_LIBC_newlib_AVAILABLE=y
232[DEBUG]    CT_LIBC_none_AVAILABLE=y
233[DEBUG]    CT_LIBC_uClibc_AVAILABLE=y
234[DEBUG]    CT_THREADS="nptl"
235[DEBUG]    # CT_DEBUG_dmalloc is not set
236[DEBUG]    # CT_DEBUG_duma is not set
237[DEBUG]    # CT_DEBUG_gdb is not set
238[DEBUG]    # CT_DEBUG_ltrace is not set
239[DEBUG]    # CT_DEBUG_strace is not set
240[DEBUG]    CT_COMPLIBS_NEEDED=y
241[DEBUG]    CT_GMP_NEEDED=y
242[DEBUG]    CT_MPFR_NEEDED=y
243[DEBUG]    CT_LLVM_NEEDED=y
244[DEBUG]    CT_OPENSSL_NEEDED=y
245[DEBUG]    CT_LIBUUID_NEEDED=y
246[DEBUG]    CT_COMPLIBS=y
247[DEBUG]    CT_GMP=y
248[DEBUG]    CT_MPFR=y
249[DEBUG]    CT_LLVM=y
250[DEBUG]    CT_OPENSSL=y
251[DEBUG]    CT_LIBUUID=y
252[DEBUG]    CT_GMP_V_5_1_1=y
253[DEBUG]    # CT_GMP_V_5_0_2 is not set
254[DEBUG]    # CT_GMP_V_5_0_1 is not set
255[DEBUG]    # CT_GMP_V_4_3_2 is not set
256[DEBUG]    # CT_GMP_V_4_3_1 is not set
257[DEBUG]    # CT_GMP_V_4_3_0 is not set
258[DEBUG]    CT_GMP_VERSION="5.1.1"
259[DEBUG]    CT_MPFR_V_3_1_2=y
260[DEBUG]    # CT_MPFR_V_3_1_0 is not set
261[DEBUG]    # CT_MPFR_V_3_0_1 is not set
262[DEBUG]    # CT_MPFR_V_3_0_0 is not set
263[DEBUG]    # CT_MPFR_V_2_4_2 is not set
264[DEBUG]    # CT_MPFR_V_2_4_1 is not set
265[DEBUG]    # CT_MPFR_V_2_4_0 is not set
266[DEBUG]    CT_MPFR_VERSION="3.1.2"
267[DEBUG]    CT_LIBUUID_E2FSPROGSLIBS=y
268[DEBUG]    # CT_LIBUUID_UTILLINUX is not set
269[DEBUG]    CT_LIBUUID_E2FSPROGSLIBS_V_1_41_14=y
270[DEBUG]    CT_LIBUUID_E2FSPROGSLIBS_VERSION="1.41.14"
271[DEBUG]    CT_OPENSSL_V_1_0_1_E=y
272[DEBUG]    # CT_OPENSSL_V_1_0_1_C is not set
273[DEBUG]    # CT_OPENSSL_V_1_0_1_B is not set
274[DEBUG]    CT_OPENSSL_VERSION="1.0.1e"
275[DEBUG]    # CT_LLVM_V_3_1 is not set
276[DEBUG]    # CT_LLVM_V_3_0 is not set
277[DEBUG]    # CT_LLVM_V_2_9 is not set
278[DEBUG]    # CT_LLVM_V_2_8 is not set
279[DEBUG]    CT_LLVM_V_2_7=y
280[DEBUG]    CT_LLVM_VERSION="2.7"
281[DEBUG]    # CT_COMPLIBS_CHECK is not set
282[DEBUG]    # CT_COMP_TOOLS is not set
283[DEBUG]    # CT_TEST_SUITE_GCC is not set
284[DEBUG]  Dumping user-supplied crosstool-NG configuration: done in 0.09s (at 00:00)
285[DEBUG]  Unsetting and unexporting MAKEFLAGS
286[INFO ]  Building environment variables
287[DEBUG]  Disabling companion tools 'make'
288[DEBUG]  Disabling companion tools 'm4'
289[DEBUG]  Disabling companion tools 'autoconf'
290[DEBUG]  Disabling companion tools 'automake'
291[DEBUG]  Disabling companion tools 'libtool'
292[DEBUG]  Disabling cc 'clang'
293[DEBUG]  Enabling cc 'gcc'
294[DEBUG]  Disabling cc 'llvmgcc'
295[DEBUG]  Disabling debug 'template'
296[DEBUG]  Disabling debug 'dmalloc'
297[DEBUG]  Disabling debug 'duma'
298[DEBUG]  Disabling debug 'gdb'
299[DEBUG]  Disabling debug 'ltrace'
300[DEBUG]  Disabling debug 'strace'
301[DEBUG]  Disabling test suite 'gcc'
302[DEBUG]  Testing '! ( -z /home/ubuntu/x-tools/i686-apple-darwin10 )'
303[WARN ]  Directory '/home/ubuntu/src' does not exist.
304[WARN ]  Will not save downloaded tarballs to local storage.
305[EXTRA]  Preparing working directories
306[DEBUG]  ==> Executing: 'mkdir' '-p' '/home/ubuntu/build/crosstool-ng/ct-ng-final/.build/tarballs'
307[DEBUG]  ==> Executing: 'mkdir' '-p' '/home/ubuntu/build/crosstool-ng/ct-ng-final/.build/src'
308[DEBUG]  ==> Executing: 'mkdir' '-p' '/home/ubuntu/build/crosstool-ng/ct-ng-final/.build/i686-apple-darwin10/build'
309[DEBUG]  ==> Executing: 'mkdir' '-p' '/home/ubuntu/build/crosstool-ng/ct-ng-final/.build/i686-apple-darwin10/buildtools/bin'
310[DEBUG]  ==> Executing: 'mkdir' '-p' '/home/ubuntu/build/crosstool-ng/ct-ng-final/.build/i686-apple-darwin10/build/configs'
311[DEBUG]  ==> Executing: 'mkdir' '-p' '/home/ubuntu/x-tools/i686-apple-darwin10'
312[DEBUG]  ==> Executing: 'mkdir' '-p' '/home/ubuntu/x-tools/i686-apple-darwin10'
313[DEBUG]  ==> Executing: 'mkdir' '-p' '/home/ubuntu/build/crosstool-ng/ct-ng-final/.build/i686-apple-darwin10/buildtools'
314[DEBUG]  ==> Executing: 'touch' '/home/ubuntu/x-tools/i686-apple-darwin10/foo'
315[DEBUG]  Testing '! ( -f /home/ubuntu/x-tools/i686-apple-darwin10/FOO )'
316[DEBUG]  ==> Executing: 'rm' '-f' '/home/ubuntu/x-tools/i686-apple-darwin10/foo'
317[DEBUG]  ==> Executing: 'chmod' '-R' 'u+w' '/home/ubuntu/x-tools/i686-apple-darwin10' '/home/ubuntu/x-tools/i686-apple-darwin10'
318[DEBUG]  Sanitised 'CT_SYSROOT_REL_DIR': 'sysroot' -> 'sysroot'
319[DEBUG]  Sanitised 'CT_SYSROOT_DIR': '/home/ubuntu/x-tools/i686-apple-darwin10/i686-apple-darwin10/sysroot' -> '/home/ubuntu/x-tools/i686-apple-darwin10/i686-apple-darwin10/sysroot'
320[DEBUG]  Sanitised 'CT_DEBUGROOT_DIR': '/home/ubuntu/x-tools/i686-apple-darwin10/i686-apple-darwin10//debug-root' -> '/home/ubuntu/x-tools/i686-apple-darwin10/i686-apple-darwin10/debug-root'
321[DEBUG]  Sanitised 'CT_HEADERS_DIR': '/home/ubuntu/x-tools/i686-apple-darwin10/i686-apple-darwin10/sysroot/usr/include' -> '/home/ubuntu/x-tools/i686-apple-darwin10/i686-apple-darwin10/sysroot/usr/include'
322[DEBUG]  ==> Executing: 'mkdir' '-p' '/home/ubuntu/x-tools/i686-apple-darwin10/i686-apple-darwin10/sysroot'
323[DEBUG]  ==> Executing: 'mkdir' '-p' '/home/ubuntu/x-tools/i686-apple-darwin10/i686-apple-darwin10/debug-root'
324[DEBUG]  ==> Executing: 'mkdir' '-p' '/home/ubuntu/x-tools/i686-apple-darwin10/lib'
325[DEBUG]  ==> Executing: 'mkdir' '-p' '/home/ubuntu/x-tools/i686-apple-darwin10/i686-apple-darwin10/sysroot/lib'
326[DEBUG]  ==> Executing: 'mkdir' '-p' '/home/ubuntu/x-tools/i686-apple-darwin10/i686-apple-darwin10/sysroot/usr/lib'
327[DEBUG]  ==> Executing: 'mkdir' '-p' '/home/ubuntu/x-tools/i686-apple-darwin10/i686-apple-darwin10/sysroot/usr/include'
328[DEBUG]  Entering '/home/ubuntu/x-tools/i686-apple-darwin10/i686-apple-darwin10'
329[DEBUG]  ==> Executing: 'ln' '-sf' 'sysroot/lib' 'lib'
330[DEBUG]  ==> Executing: 'ln' '-sf' 'lib' '/home/ubuntu/x-tools/i686-apple-darwin10/lib32'
331[DEBUG]  ==> Executing: 'ln' '-sf' 'lib' '/home/ubuntu/x-tools/i686-apple-darwin10/lib64'
332[DEBUG]  ==> Executing: 'ln' '-sf' 'lib' '/home/ubuntu/x-tools/i686-apple-darwin10/i686-apple-darwin10/sysroot/lib32'
333[DEBUG]  ==> Executing: 'ln' '-sf' 'lib' '/home/ubuntu/x-tools/i686-apple-darwin10/i686-apple-darwin10/sysroot/lib64'
334[DEBUG]  ==> Executing: 'ln' '-sf' 'lib' '/home/ubuntu/x-tools/i686-apple-darwin10/i686-apple-darwin10/sysroot/usr/lib32'
335[DEBUG]  ==> Executing: 'ln' '-sf' 'lib' '/home/ubuntu/x-tools/i686-apple-darwin10/i686-apple-darwin10/sysroot/usr/lib64'
336[DEBUG]  ==> Executing: 'ln' '-sf' 'lib' '/home/ubuntu/x-tools/i686-apple-darwin10/i686-apple-darwin10/lib32'
337[DEBUG]  ==> Executing: 'ln' '-sf' 'lib' '/home/ubuntu/x-tools/i686-apple-darwin10/i686-apple-darwin10/lib64'
338[DEBUG]  Making build system tools available
339[DEBUG]    'i686-build_pc-linux-gnu-ar' -> '/usr/bin/ar'
340[DEBUG]  ==> Executing: 'chmod' '700' '/home/ubuntu/build/crosstool-ng/ct-ng-final/.build/i686-apple-darwin10/buildtools/bin/i686-build_pc-linux-gnu-ar'
341[ALL  ]  export 'AR=i686-build_pc-linux-gnu-ar'
342[DEBUG]    'i686-build_pc-linux-gnu-as' -> '/usr/bin/as'
343[DEBUG]  ==> Executing: 'chmod' '700' '/home/ubuntu/build/crosstool-ng/ct-ng-final/.build/i686-apple-darwin10/buildtools/bin/i686-build_pc-linux-gnu-as'
344[ALL  ]  export 'AS=i686-build_pc-linux-gnu-as'
345[DEBUG]    Missing: 'i686-pc-linux-gnu-dlltool' or 'i686-pc-linux-gnu-dlltool' or 'dlltool' : not required.
346[DEBUG]    'i686-build_pc-linux-gnu-gcc' -> '/usr/bin/gcc'
347[DEBUG]  ==> Executing: 'chmod' '700' '/home/ubuntu/build/crosstool-ng/ct-ng-final/.build/i686-apple-darwin10/buildtools/bin/i686-build_pc-linux-gnu-gcc'
348[ALL  ]  export 'CC=i686-build_pc-linux-gnu-gcc'
349[DEBUG]    'i686-build_pc-linux-gnu-g++' -> '/usr/bin/g++'
350[DEBUG]  ==> Executing: 'chmod' '700' '/home/ubuntu/build/crosstool-ng/ct-ng-final/.build/i686-apple-darwin10/buildtools/bin/i686-build_pc-linux-gnu-g++'
351[ALL  ]  export 'CXX=i686-build_pc-linux-gnu-g++'
352[DEBUG]    'i686-build_pc-linux-gnu-c++' -> '/usr/bin/c++'
353[DEBUG]  ==> Executing: 'chmod' '700' '/home/ubuntu/build/crosstool-ng/ct-ng-final/.build/i686-apple-darwin10/buildtools/bin/i686-build_pc-linux-gnu-c++'
354[DEBUG]  Testing '! (  = y )'
355[DEBUG]    Missing: 'i686-pc-linux-gnu-gnatbind' or 'i686-pc-linux-gnu-gnatbind' or 'gnatbind' : not required.
356[DEBUG]    Missing: 'i686-pc-linux-gnu-gnatmake' or 'i686-pc-linux-gnu-gnatmake' or 'gnatmake' : not required.
357[DEBUG]    'i686-build_pc-linux-gnu-ld' -> '/usr/bin/ld'
358[DEBUG]  ==> Executing: 'chmod' '700' '/home/ubuntu/build/crosstool-ng/ct-ng-final/.build/i686-apple-darwin10/buildtools/bin/i686-build_pc-linux-gnu-ld'
359[ALL  ]  export 'LD=i686-build_pc-linux-gnu-ld'
360[DEBUG]    'i686-build_pc-linux-gnu-nm' -> '/usr/bin/nm'
361[DEBUG]  ==> Executing: 'chmod' '700' '/home/ubuntu/build/crosstool-ng/ct-ng-final/.build/i686-apple-darwin10/buildtools/bin/i686-build_pc-linux-gnu-nm'
362[ALL  ]  export 'NM=i686-build_pc-linux-gnu-nm'
363[DEBUG]    'i686-build_pc-linux-gnu-objcopy' -> '/home/ubuntu/build/crosstool-ng/ct-ng-final/.build/tools/bin/objcopy'
364[DEBUG]  ==> Executing: 'chmod' '700' '/home/ubuntu/build/crosstool-ng/ct-ng-final/.build/i686-apple-darwin10/buildtools/bin/i686-build_pc-linux-gnu-objcopy'
365[ALL  ]  export 'OBJCOPY=i686-build_pc-linux-gnu-objcopy'
366[DEBUG]    'i686-build_pc-linux-gnu-objdump' -> '/home/ubuntu/build/crosstool-ng/ct-ng-final/.build/tools/bin/objdump'
367[DEBUG]  ==> Executing: 'chmod' '700' '/home/ubuntu/build/crosstool-ng/ct-ng-final/.build/i686-apple-darwin10/buildtools/bin/i686-build_pc-linux-gnu-objdump'
368[ALL  ]  export 'OBJDUMP=i686-build_pc-linux-gnu-objdump'
369[DEBUG]    'i686-build_pc-linux-gnu-ranlib' -> '/usr/bin/ranlib'
370[DEBUG]  ==> Executing: 'chmod' '700' '/home/ubuntu/build/crosstool-ng/ct-ng-final/.build/i686-apple-darwin10/buildtools/bin/i686-build_pc-linux-gnu-ranlib'
371[ALL  ]  export 'RANLIB=i686-build_pc-linux-gnu-ranlib'
372[DEBUG]    'i686-build_pc-linux-gnu-strip' -> '/usr/bin/strip'
373[DEBUG]  ==> Executing: 'chmod' '700' '/home/ubuntu/build/crosstool-ng/ct-ng-final/.build/i686-apple-darwin10/buildtools/bin/i686-build_pc-linux-gnu-strip'
374[ALL  ]  export 'STRIP=i686-build_pc-linux-gnu-strip'
375[DEBUG]    Missing: 'i686-pc-linux-gnu-windres' or 'i686-pc-linux-gnu-windres' or 'windres' : not required.
376[DEBUG]    'i686-build_pc-linux-gnu-ar' -> '/usr/bin/ar'
377[DEBUG]  ==> Executing: 'chmod' '700' '/home/ubuntu/build/crosstool-ng/ct-ng-final/.build/i686-apple-darwin10/buildtools/bin/i686-build_pc-linux-gnu-ar'
378[ALL  ]  export 'AR=i686-build_pc-linux-gnu-ar'
379[DEBUG]    'i686-build_pc-linux-gnu-as' -> '/usr/bin/as'
380[DEBUG]  ==> Executing: 'chmod' '700' '/home/ubuntu/build/crosstool-ng/ct-ng-final/.build/i686-apple-darwin10/buildtools/bin/i686-build_pc-linux-gnu-as'
381[ALL  ]  export 'AS=i686-build_pc-linux-gnu-as'
382[DEBUG]    Missing: 'i686-pc-linux-gnu-dlltool' or 'i686-pc-linux-gnu-dlltool' or 'dlltool' : not required.
383[DEBUG]    'i686-build_pc-linux-gnu-gcc' -> '/usr/bin/gcc'
384[DEBUG]  ==> Executing: 'chmod' '700' '/home/ubuntu/build/crosstool-ng/ct-ng-final/.build/i686-apple-darwin10/buildtools/bin/i686-build_pc-linux-gnu-gcc'
385[ALL  ]  export 'CC=i686-build_pc-linux-gnu-gcc'
386[DEBUG]    'i686-build_pc-linux-gnu-g++' -> '/usr/bin/g++'
387[DEBUG]  ==> Executing: 'chmod' '700' '/home/ubuntu/build/crosstool-ng/ct-ng-final/.build/i686-apple-darwin10/buildtools/bin/i686-build_pc-linux-gnu-g++'
388[ALL  ]  export 'CXX=i686-build_pc-linux-gnu-g++'
389[DEBUG]    'i686-build_pc-linux-gnu-c++' -> '/usr/bin/c++'
390[DEBUG]  ==> Executing: 'chmod' '700' '/home/ubuntu/build/crosstool-ng/ct-ng-final/.build/i686-apple-darwin10/buildtools/bin/i686-build_pc-linux-gnu-c++'
391[DEBUG]  Testing '! (  = y )'
392[DEBUG]    Missing: 'i686-pc-linux-gnu-gnatbind' or 'i686-pc-linux-gnu-gnatbind' or 'gnatbind' : not required.
393[DEBUG]    Missing: 'i686-pc-linux-gnu-gnatmake' or 'i686-pc-linux-gnu-gnatmake' or 'gnatmake' : not required.
394[DEBUG]    'i686-build_pc-linux-gnu-ld' -> '/usr/bin/ld'
395[DEBUG]  ==> Executing: 'chmod' '700' '/home/ubuntu/build/crosstool-ng/ct-ng-final/.build/i686-apple-darwin10/buildtools/bin/i686-build_pc-linux-gnu-ld'
396[ALL  ]  export 'LD=i686-build_pc-linux-gnu-ld'
397[DEBUG]    'i686-build_pc-linux-gnu-nm' -> '/usr/bin/nm'
398[DEBUG]  ==> Executing: 'chmod' '700' '/home/ubuntu/build/crosstool-ng/ct-ng-final/.build/i686-apple-darwin10/buildtools/bin/i686-build_pc-linux-gnu-nm'
399[ALL  ]  export 'NM=i686-build_pc-linux-gnu-nm'
400[DEBUG]    'i686-build_pc-linux-gnu-objcopy' -> '/home/ubuntu/build/crosstool-ng/ct-ng-final/.build/tools/bin/objcopy'
401[DEBUG]  ==> Executing: 'chmod' '700' '/home/ubuntu/build/crosstool-ng/ct-ng-final/.build/i686-apple-darwin10/buildtools/bin/i686-build_pc-linux-gnu-objcopy'
402[ALL  ]  export 'OBJCOPY=i686-build_pc-linux-gnu-objcopy'
403[DEBUG]    'i686-build_pc-linux-gnu-objdump' -> '/home/ubuntu/build/crosstool-ng/ct-ng-final/.build/tools/bin/objdump'
404[DEBUG]  ==> Executing: 'chmod' '700' '/home/ubuntu/build/crosstool-ng/ct-ng-final/.build/i686-apple-darwin10/buildtools/bin/i686-build_pc-linux-gnu-objdump'
405[ALL  ]  export 'OBJDUMP=i686-build_pc-linux-gnu-objdump'
406[DEBUG]    'i686-build_pc-linux-gnu-ranlib' -> '/usr/bin/ranlib'
407[DEBUG]  ==> Executing: 'chmod' '700' '/home/ubuntu/build/crosstool-ng/ct-ng-final/.build/i686-apple-darwin10/buildtools/bin/i686-build_pc-linux-gnu-ranlib'
408[ALL  ]  export 'RANLIB=i686-build_pc-linux-gnu-ranlib'
409[DEBUG]    'i686-build_pc-linux-gnu-strip' -> '/usr/bin/strip'
410[DEBUG]  ==> Executing: 'chmod' '700' '/home/ubuntu/build/crosstool-ng/ct-ng-final/.build/i686-apple-darwin10/buildtools/bin/i686-build_pc-linux-gnu-strip'
411[ALL  ]  export 'STRIP=i686-build_pc-linux-gnu-strip'
412[DEBUG]    Missing: 'i686-pc-linux-gnu-windres' or 'i686-pc-linux-gnu-windres' or 'windres' : not required.
413[DEBUG]    'makeinfo' -> '/usr/bin/makeinfo'
414[DEBUG]  ==> Executing: 'chmod' '700' '/home/ubuntu/build/crosstool-ng/ct-ng-final/.build/i686-apple-darwin10/buildtools/bin/makeinfo'
415[DEBUG]  CFLAGS for host compiler: '-O2 -g -pipe -m32'
416[DEBUG]  LDFLAGS for host compiler: ' -m32'
417[DEBUG]  =================================================================
418[DEBUG]  Checking that we can run gcc -v
419[DEBUG]    ==> Executing: 'i686-build_pc-linux-gnu-gcc' '-v'
420[DEBUG]    Using built-in specs.
421[DEBUG]    COLLECT_GCC=/usr/bin/gcc
422[DEBUG]    COLLECT_LTO_WRAPPER=/usr/lib/gcc/i686-linux-gnu/4.6/lto-wrapper
423[DEBUG]    Target: i686-linux-gnu
424[DEBUG]    Configured with: ../src/configure -v --with-pkgversion='Ubuntu/Linaro 4.6.3-1ubuntu5' --with-bugurl=file:///usr/share/doc/gcc-4.6/README.Bugs --enable-languages=c,c++,fortran,objc,obj-c++ --prefix=/usr --program-suffix=-4.6 --enable-shared --enable-linker-build-id --with-system-zlib --libexecdir=/usr/lib --without-included-gettext --enable-threads=posix --with-gxx-include-dir=/usr/include/c++/4.6 --libdir=/usr/lib --enable-nls --with-sysroot=/ --enable-clocale=gnu --enable-libstdcxx-debug --enable-libstdcxx-time=yes --enable-gnu-unique-object --enable-plugin --enable-objc-gc --enable-targets=all --disable-werror --with-arch-32=i686 --with-tune=generic --enable-checking=release --build=i686-linux-gnu --host=i686-linux-gnu --target=i686-linux-gnu
425[DEBUG]    Thread model: posix
426[DEBUG]    gcc version 4.6.3 (Ubuntu/Linaro 4.6.3-1ubuntu5)
427[DEBUG]  Checking that we can run gcc -v: done in 0.04s (at 00:00)
428[DEBUG]  =================================================================
429[DEBUG]  Checking that gcc can compile a trivial program
430[DEBUG]    ==> Executing: 'i686-build_pc-linux-gnu-gcc' '-O2' '-g' '-pipe' '-m32' '-m32' '/home/ubuntu/build/crosstool-ng/ct-ng-final/.build/i686-apple-darwin10/build/test.c' '-o' '/home/ubuntu/build/crosstool-ng/ct-ng-final/.build/i686-apple-darwin10/build/.gccout'
431[DEBUG]  Checking that gcc can compile a trivial program: done in 0.08s (at 00:00)
432[EXTRA]  Installing user-supplied crosstool-NG configuration
433[DEBUG]  ==> Executing: 'mkdir' '-p' '/home/ubuntu/x-tools/i686-apple-darwin10/bin'
434[DEBUG]  ==> Executing: 'install' '-m' '0755' '/usr/local/lib/ct-ng.hg+unknown-20000101.000000/scripts/toolchain-config.in' '/home/ubuntu/x-tools/i686-apple-darwin10/bin/i686-apple-darwin10-ct-ng.config'
435[DEBUG]  ==> Executing: 'sed' '-i' '-e' 's,@@grep@@,"/bin/grep",;' '/home/ubuntu/x-tools/i686-apple-darwin10/bin/i686-apple-darwin10-ct-ng.config'
436[EXTRA]  =================================================================
437[EXTRA]  Dumping internal crosstool-NG configuration
438[EXTRA]    Building a toolchain for:
439[EXTRA]      build  = i686-pc-linux-gnu
440[EXTRA]      host   = i686-pc-linux-gnu
441[EXTRA]      target = i686-apple-darwin10
442[DEBUG]    CT_ARCH=x86
443[DEBUG]    CT_ARCH_32=y
444[DEBUG]    CT_ARCH_ARCH=
445[DEBUG]    CT_ARCH_BINFMT_MACH_O=y
446[DEBUG]    CT_ARCH_BITNESS=32
447[DEBUG]    CT_ARCH_CPU=
448[DEBUG]    CT_ARCH_DEFAULT_32=y
449[DEBUG]    CT_ARCH_FLOAT=
450[DEBUG]    CT_ARCH_SUFFIX=
451[DEBUG]    CT_ARCH_SUPPORTS_32=y
452[DEBUG]    CT_ARCH_SUPPORTS_64=y
453[DEBUG]    CT_ARCH_SUPPORTS_WITH_ARCH=y
454[DEBUG]    CT_ARCH_SUPPORTS_WITH_CPU=y
455[DEBUG]    CT_ARCH_SUPPORTS_WITH_TUNE=y
456[DEBUG]    CT_ARCH_TARGET_CFLAGS='     -mtune=i686  '
457[DEBUG]    CT_ARCH_TARGET_LDFLAGS=' '
458[DEBUG]    CT_ARCH_TUNE=i686
459[DEBUG]    CT_ARCH_TUNE_CFLAG=-mtune=i686
460[DEBUG]    CT_ARCH_USE_MMU=y
461[DEBUG]    CT_ARCH_WITH_TUNE=--with-tune=i686
462[DEBUG]    CT_ARCH_alpha_AVAILABLE=y
463[DEBUG]    CT_ARCH_arm_AVAILABLE=y
464[DEBUG]    CT_ARCH_avr32_AVAILABLE=y
465[DEBUG]    CT_ARCH_blackfin_AVAILABLE=y
466[DEBUG]    CT_ARCH_m68k_AVAILABLE=y
467[DEBUG]    CT_ARCH_microblaze_AVAILABLE=y
468[DEBUG]    CT_ARCH_mips_AVAILABLE=y
469[DEBUG]    CT_ARCH_powerpc_AVAILABLE=y
470[DEBUG]    CT_ARCH_s390_AVAILABLE=y
471[DEBUG]    CT_ARCH_sh_AVAILABLE=y
472[DEBUG]    CT_ARCH_sparc_AVAILABLE=y
473[DEBUG]    CT_ARCH_x86=y
474[DEBUG]    CT_ARCH_x86_AVAILABLE=y
475[DEBUG]    CT_BINUTILS=cctools
476[DEBUG]    CT_BINUTILS_VERSION=809
477[DEBUG]    CT_BINUTILS_cctools=y
478[DEBUG]    CT_BUILD=i686-build_pc-linux-gnu
479[DEBUG]    CT_BUILDTOOLS_PREFIX_DIR=/home/ubuntu/build/crosstool-ng/ct-ng-final/.build/i686-apple-darwin10/buildtools
480[DEBUG]    CT_BUILD_DIR=/home/ubuntu/build/crosstool-ng/ct-ng-final/.build/i686-apple-darwin10/build
481[DEBUG]    CT_BUILD_PREFIX=
482[DEBUG]    CT_BUILD_SUFFIX=
483[DEBUG]    CT_CCTOOLS_V_809=y
484[DEBUG]    CT_CC_CXA_ATEXIT=y
485[DEBUG]    CT_CC_FACILITY_LIST=' gcc'
486[DEBUG]    CT_CC_GCC_APPLE=y
487[DEBUG]    CT_CC_GCC_CORE_EXTRA_CONFIG_ARRAY=()
488[DEBUG]    CT_CC_GCC_ENABLE_CXX_FLAGS=
489[DEBUG]    CT_CC_GCC_ENABLE_TARGET_OPTSPACE=y
490[DEBUG]    CT_CC_GCC_EXTRA_CONFIG_ARRAY=()
491[DEBUG]    CT_CC_GCC_SJLJ_EXCEPTIONS=m
492[DEBUG]    CT_CC_GCC_VERSION=5666.3
493[DEBUG]    CT_CC_GCC_V_apple_5666_3=y
494[DEBUG]    CT_CC_LANG_CXX=y
495[DEBUG]    CT_CC_LANG_OBJC=y
496[DEBUG]    CT_CC_LANG_OBJCXX=y
497[DEBUG]    CT_CC_LANG_OTHERS=
498[DEBUG]    CT_CC_LLVMGCC_CORE_EXTRA_CONFIG_ARRAY=()
499[DEBUG]    CT_CC_LLVMGCC_EXTRA_CONFIG_ARRAY=()
500[DEBUG]    CT_CC_SUPPORT_ADA=y
501[DEBUG]    CT_CC_SUPPORT_CXX=y
502[DEBUG]    CT_CC_SUPPORT_FORTRAN=y
503[DEBUG]    CT_CC_SUPPORT_JAVA=y
504[DEBUG]    CT_CC_SUPPORT_OBJC=y
505[DEBUG]    CT_CC_SUPPORT_OBJCXX=y
506[DEBUG]    CT_CC_gcc=y
507[DEBUG]    CT_CFLAGS_FOR_BUILD='-O2 -g -m32'
508[DEBUG]    CT_CFLAGS_FOR_HOST='-O2 -g -pipe -m32'
509[DEBUG]    CT_COMPLIBS=y
510[DEBUG]    CT_COMPLIBS_NEEDED=y
511[DEBUG]    CT_COMP_LIBS_FACILITY_LIST=' gmp mpfr ppl isl cloog mpc llvm libelf libuuid openssl'
512[DEBUG]    CT_COMP_TOOLS_FACILITY_LIST=
513[DEBUG]    CT_CONFIGURE_has_svn=y
514[DEBUG]    CT_CONFIGURE_has_xz=y
515[DEBUG]    CT_CONFIG_DIR=/home/ubuntu/build/crosstool-ng/ct-ng-final/.build/i686-apple-darwin10/build/configs
516[DEBUG]    CT_CONFIG_SHELL=/bin/bash
517[DEBUG]    CT_CONFIG_SHELL_BASH=y
518[DEBUG]    CT_CONNECT_TIMEOUT=10
519[DEBUG]    CT_CROSS=y
520[DEBUG]    CT_CUSTOM_LOCATION_ROOT_DIR=
521[DEBUG]    CT_DARWIN=y
522[DEBUG]    CT_DARWIN_MAC_OSX_V_10_6=y
523[DEBUG]    CT_DARWIN_SDK=MacOSX10.6.sdk
524[DEBUG]    CT_DARWIN_SDK_PATH=/home/ubuntu/MacOSX10.6.sdk
525[DEBUG]    CT_DARWIN_VERSION=10
526[DEBUG]    CT_DEBUGROOT_DIR=/home/ubuntu/x-tools/i686-apple-darwin10/i686-apple-darwin10/debug-root
527[DEBUG]    CT_DEBUG_FACILITY_LIST=
528[DEBUG]    CT_DOC_DIR=/usr/local/share/doc/crosstool-ng/ct-ng.hg+unknown-20000101.000000
529[DEBUG]    CT_DYLD_VERSION=210.2.3
530[DEBUG]    CT_EXPERIMENTAL=y
531[DEBUG]    CT_EXPORT_BUILD_TOOLS=yes
532[DEBUG]    CT_EXTRA_CFLAGS_FOR_BUILD=-m32
533[DEBUG]    CT_EXTRA_CFLAGS_FOR_HOST=-m32
534[DEBUG]    CT_EXTRA_LDFLAGS_FOR_BUILD=-m32
535[DEBUG]    CT_EXTRA_LDFLAGS_FOR_HOST=-m32
536[DEBUG]    CT_FORCE_SYSROOT=y
537[DEBUG]    CT_GMP=y
538[DEBUG]    CT_GMP_NEEDED=y
539[DEBUG]    CT_GMP_VERSION=5.1.1
540[DEBUG]    CT_GMP_V_5_1_1=y
541[DEBUG]    CT_HEADERS_DIR=/home/ubuntu/x-tools/i686-apple-darwin10/i686-apple-darwin10/sysroot/usr/include
542[DEBUG]    CT_HOST=i686-build_pc-linux-gnu
543[DEBUG]    CT_HOST_COMPLIBS_DIR=/home/ubuntu/build/crosstool-ng/ct-ng-final/.build/i686-apple-darwin10/buildtools
544[DEBUG]    CT_INSTALL_DIR=/home/ubuntu/x-tools/i686-apple-darwin10
545[DEBUG]    CT_INSTALL_DIR_RO=y
546[DEBUG]    CT_KERNEL=darwin
547[DEBUG]    CT_KERNEL_SUPPORTS_SHARED_LIBS=y
548[DEBUG]    CT_KERNEL_bare_metal_AVAILABLE=y
549[DEBUG]    CT_KERNEL_darwin=y
550[DEBUG]    CT_KERNEL_darwin_AVAILABLE=y
551[DEBUG]    CT_KERNEL_linux_AVAILABLE=y
552[DEBUG]    CT_KERNEL_mingw32_AVAILABLE=y
553[DEBUG]    CT_KERNEL_windows_AVAILABLE=y
554[DEBUG]    CT_LD64_VERSION=127.2
555[DEBUG]    CT_LDFLAGS_FOR_BUILD=' -m32'
556[DEBUG]    CT_LDFLAGS_FOR_HOST=' -m32'
557[DEBUG]    CT_LIBC=none
558[DEBUG]    CT_LIBC_eglibc_AVAILABLE=y
559[DEBUG]    CT_LIBC_glibc_AVAILABLE=y
560[DEBUG]    CT_LIBC_mingw_AVAILABLE=y
561[DEBUG]    CT_LIBC_newlib_AVAILABLE=y
562[DEBUG]    CT_LIBC_none=y
563[DEBUG]    CT_LIBC_none_AVAILABLE=y
564[DEBUG]    CT_LIBC_uClibc_AVAILABLE=y
565[DEBUG]    CT_LIBUUID=y
566[DEBUG]    CT_LIBUUID_E2FSPROGSLIBS=y
567[DEBUG]    CT_LIBUUID_E2FSPROGSLIBS_VERSION=1.41.14
568[DEBUG]    CT_LIBUUID_E2FSPROGSLIBS_V_1_41_14=y
569[DEBUG]    CT_LIBUUID_NEEDED=y
570[DEBUG]    CT_LIB_DIR=/usr/local/lib/ct-ng.hg+unknown-20000101.000000
571[DEBUG]    CT_LLVM=y
572[DEBUG]    CT_LLVM_FULLNAME=llvm-2.7
573[DEBUG]    CT_LLVM_NEEDED=y
574[DEBUG]    CT_LLVM_SUFFIX=
575[DEBUG]    CT_LLVM_VERSION=2.7
576[DEBUG]    CT_LLVM_V_2_7=y
577[DEBUG]    CT_LOAD=
578[DEBUG]    CT_LOCAL_TARBALLS_DIR=/home/ubuntu/src
579[DEBUG]    CT_LOG_EXTRA=y
580[DEBUG]    CT_LOG_FILE_COMPRESS=y
581[DEBUG]    CT_LOG_LEVEL_ALL=7
582[DEBUG]    CT_LOG_LEVEL_CFG=4
583[DEBUG]    CT_LOG_LEVEL_DEBUG=8
584[DEBUG]    CT_LOG_LEVEL_ERROR=0
585[DEBUG]    CT_LOG_LEVEL_EXTRA=3
586[DEBUG]    CT_LOG_LEVEL_FILE=5
587[DEBUG]    CT_LOG_LEVEL_INFO=2
588[DEBUG]    CT_LOG_LEVEL_MAX=EXTRA
589[DEBUG]    CT_LOG_LEVEL_STATE=6
590[DEBUG]    CT_LOG_LEVEL_WARN=1
591[DEBUG]    CT_LOG_PROGRESS_BAR=y
592[DEBUG]    CT_LOG_TO_FILE=y
593[DEBUG]    CT_MODULES=y
594[DEBUG]    CT_MPFR=y
595[DEBUG]    CT_MPFR_NEEDED=y
596[DEBUG]    CT_MPFR_VERSION=3.1.2
597[DEBUG]    CT_MPFR_V_3_1_2=y
598[DEBUG]    CT_MULTILIB=y
599[DEBUG]    CT_NG=/usr/local/bin/ct-ng
600[DEBUG]    CT_OPENSSL=y
601[DEBUG]    CT_OPENSSL_NEEDED=y
602[DEBUG]    CT_OPENSSL_VERSION=1.0.1e
603[DEBUG]    CT_OPENSSL_V_1_0_1_E=y
604[DEBUG]    CT_OVERIDE_CONFIG_GUESS_SUB=y
605[DEBUG]    CT_PARALLEL_JOBS=0
606[DEBUG]    CT_PATCH_BUNDLED=y
607[DEBUG]    CT_PATCH_ORDER=bundled
608[DEBUG]    CT_PKGVERSION='crosstool-NG hg+unknown-20000101.000000'
609[DEBUG]    CT_PREFIX_DIR=/home/ubuntu/x-tools/i686-apple-darwin10
610[DEBUG]    CT_REAL_BUILD=i686-pc-linux-gnu
611[DEBUG]    CT_REAL_HOST=i686-pc-linux-gnu
612[DEBUG]    CT_REAL_TARGET=i686-apple-darwin10
613[DEBUG]    CT_REMOVE_DOCS=y
614[DEBUG]    CT_RESTART=
615[DEBUG]    CT_RM_RF_PREFIX_DIR=y
616[DEBUG]    CT_SAVE_TARBALLS=
617[DEBUG]    CT_SHARED_LIBS=y
618[DEBUG]    CT_SRC_DIR=/home/ubuntu/build/crosstool-ng/ct-ng-final/.build/src
619[DEBUG]    CT_STAR_DATE=946684800316420130
620[DEBUG]    CT_STAR_DATE_HUMAN=20000101.000000
621[DEBUG]    CT_STATE_DIR=/home/ubuntu/build/crosstool-ng/ct-ng-final/.build/i686-apple-darwin10/state
622[DEBUG]    CT_STEPS='libc_check_config companion_libs_for_build binutils_for_build companion_libs_for_host binutils_for_host cc_core_pass_1 kernel_headers libc_start_files cc_core_pass_2 libc cc_for_build cc_for_host libelf_for_target binutils_for_target debug test_suite finish '
623[DEBUG]    CT_STEP_COUNT=2
624[DEBUG]    CT_STEP_LEVEL=([2]="EXTRA")
625[DEBUG]    CT_STEP_MESSAGE=([1]="(top-level)" [2]="Dumping internal crosstool-NG configuration")
626[DEBUG]    CT_STEP_START=([2]="946684800607897942")
627[DEBUG]    CT_STOP=
628[DEBUG]    CT_STRIP_ALL_TOOLCHAIN_EXECUTABLES=y
629[DEBUG]    CT_SYSROOT_DIR=/home/ubuntu/x-tools/i686-apple-darwin10/i686-apple-darwin10/sysroot
630[DEBUG]    CT_SYSROOT_DIR_PREFIX=
631[DEBUG]    CT_SYSROOT_NAME=sysroot
632[DEBUG]    CT_SYSROOT_REL_DIR=sysroot
633[DEBUG]    CT_SYS_GCC=4.6
634[DEBUG]    CT_SYS_HOSTNAME=ubuntu.defaultdomain
635[DEBUG]    CT_SYS_KERNEL=Linux
636[DEBUG]    CT_SYS_MACHINE=i686
637[DEBUG]    CT_SYS_OS=Linux
638[DEBUG]    CT_SYS_PROCESSOR=i686
639[DEBUG]    CT_SYS_REVISION=3.2.0-45-virtual
640[DEBUG]    CT_SYS_TARGET=i686-pc-linux-gnu
641[DEBUG]    CT_SYS_USER=ubuntu
642[DEBUG]    CT_TARBALLS_DIR=/home/ubuntu/build/crosstool-ng/ct-ng-final/.build/tarballs
643[DEBUG]    CT_TARGET=i686-apple-darwin10
644[DEBUG]    CT_TARGET_ALIAS=
645[DEBUG]    CT_TARGET_ALIAS_SED_EXPR=
646[DEBUG]    CT_TARGET_ARCH=i686
647[DEBUG]    CT_TARGET_CFLAGS='     -mtune=i686   '
648[DEBUG]    CT_TARGET_KERNEL=darwin10
649[DEBUG]    CT_TARGET_LDFLAGS='  '
650[DEBUG]    CT_TARGET_SYS=
651[DEBUG]    CT_TARGET_VENDOR=apple
652[DEBUG]    CT_TEST_SUITE_DIR=/home/ubuntu/x-tools/i686-apple-darwin10/test-suite
653[DEBUG]    CT_TEST_SUITE_FACILITY_LIST=
654[DEBUG]    CT_THREADS=nptl
655[DEBUG]    CT_TOOLCHAIN_BUGURL=
656[DEBUG]    CT_TOOLCHAIN_ID='crosstool-hg+unknown-20000101.000000 build 20000101.000000 by ubuntu@ubuntu.defaultdomain'
657[DEBUG]    CT_TOOLCHAIN_PKGVERSION=
658[DEBUG]    CT_TOOLCHAIN_TYPE=cross
659[DEBUG]    CT_TOOLS_OVERIDE_DIR=/home/ubuntu/build/crosstool-ng/ct-ng-final/.build/tools
660[DEBUG]    CT_TOP_DIR=/home/ubuntu/build/crosstool-ng/ct-ng-final
661[DEBUG]    CT_USE_PIPES=y
662[DEBUG]    CT_USE_SYSROOT=y
663[DEBUG]    CT_VERSION=hg+unknown-20000101.000000
664[DEBUG]    CT_WORK_DIR=/home/ubuntu/build/crosstool-ng/ct-ng-final/.build
665[DEBUG]    Other environment:
666[DEBUG]    AS=i686-build_pc-linux-gnu-as
667[DEBUG]    grep=/bin/grep
668[DEBUG]    AR=i686-build_pc-linux-gnu-ar
669[DEBUG]    SHELL=/bin/bash
670[DEBUG]    NM=i686-build_pc-linux-gnu-nm
671[DEBUG]    SSH_CLIENT=10.0.2.2 57797 22
672[DEBUG]    LD_PRELOAD=/usr/lib/faketime/libfaketime.so.1
673[DEBUG]    patch=/usr/bin/patch
674[DEBUG]    bash=/bin/bash
675[DEBUG]    libtoolize=/usr/bin/libtoolize
676[DEBUG]    OLDPWD=/home/ubuntu/x-tools/i686-apple-darwin10/i686-apple-darwin10
677[DEBUG]    objcopy=/usr/bin/objcopy
678[DEBUG]    LC_ALL=C
679[DEBUG]    USER=ubuntu
680[DEBUG]    install=/usr/bin/install -c
681[DEBUG]    V=
682[DEBUG]    CONFIG_SITE=
683[DEBUG]    MAKELEVEL=1
684[DEBUG]    OUTDIR=/home/ubuntu/out
685[DEBUG]    MFLAGS=- --no-print-directory -r
686[DEBUG]    readelf=/usr/bin/readelf
687[DEBUG]    ECHO=echo
688[DEBUG]    KCONFIG_TOP=config/config.in
689[DEBUG]    PATH=/home/ubuntu/x-tools/i686-apple-darwin10/bin:/home/ubuntu/build/crosstool-ng/ct-ng-final/.build/i686-apple-darwin10/buildtools/bin:/home/ubuntu/build/crosstool-ng/ct-ng-final/.build/tools/bin:/usr/local/sbin:/usr/local/bin:/usr/sbin:/usr/bin:/sbin:/bin:/usr/games:/usr/apple-osx/bin/:/usr/local/ct-ng-build
690[DEBUG]    objdump=/usr/bin/objdump
691[DEBUG]    MAIL=/var/mail/ubuntu
692[DEBUG]    LD=i686-build_pc-linux-gnu-ld
693[DEBUG]    sed=/bin/sed
694[DEBUG]    PWD=/home/ubuntu/build/crosstool-ng/ct-ng-final
695[DEBUG]    STRIP=i686-build_pc-linux-gnu-strip
696[DEBUG]    gperf=/usr/bin/gperf
697[DEBUG]    CONF=/usr/local/lib/ct-ng.hg+unknown-20000101.000000/kconfig/conf
698[DEBUG]    LANG=C
699[DEBUG]    TZ=UTC
700[DEBUG]    awk=/usr/bin/awk
701[DEBUG]    CXX=i686-build_pc-linux-gnu-g++
702[DEBUG]    OBJCOPY=i686-build_pc-linux-gnu-objcopy
703[DEBUG]    CONFIG_SHELL=/bin/bash
704[DEBUG]    HOME=/home/ubuntu
705[DEBUG]    SHLVL=4
706[DEBUG]    make=/usr/bin/make
707[DEBUG]    GREP_OPTIONS=
708[DEBUG]    FAKETIME=2000-01-01 00:00:00
709[DEBUG]    libtool=/usr/bin/libtool
710[DEBUG]    SILENT=@
711[DEBUG]    LOGNAME=ubuntu
712[DEBUG]    SSH_CONNECTION=10.0.2.2 57797 10.0.2.15 22
713[DEBUG]    RANLIB=i686-build_pc-linux-gnu-ranlib
714[DEBUG]    CC=i686-build_pc-linux-gnu-gcc
715[DEBUG]    OBJDUMP=i686-build_pc-linux-gnu-objdump
716[DEBUG]    _=/usr/bin/printenv
717[EXTRA]  Dumping internal crosstool-NG configuration: done in 0.15s (at 00:00)
718
719[snip...]
720
721[INFO ]  Extracting and patching toolchain components: done in -0000000000000000000000.44s (at 00:00)
722[INFO ]  =================================================================
723[INFO ]  Installing GMP for host
724[DEBUG]    Entering '/home/ubuntu/build/crosstool-ng/ct-ng-final/.build/i686-apple-darwin10/build/build-gmp-host-i686-build_pc-linux-gnu'
725[EXTRA]    Configuring GMP
726[DEBUG]    ==> Executing: 'CFLAGS=-O2 -g -pipe -m32 -fexceptions' 'LDFLAGS= -m32' '/home/ubuntu/build/crosstool-ng/ct-ng-final/.build/src/gmp-5.1.1/configure' '--build=i686-build_pc-linux-gnu' '--host=i686-build_pc-linux-gnu' '--prefix=/home/ubuntu/build/crosstool-ng/ct-ng-final/.build/i686-apple-darwin10/buildtools' '--enable-fft' '--enable-mpbsd' '--enable-cxx' '--disable-shared' '--enable-static' 'ABI=32'
727[CFG  ]    configure: WARNING: unrecognized options: --enable-mpbsd
728[CFG  ]    checking build system type... i686-build_pc-linux-gnu
729[CFG  ]    checking host system type... i686-build_pc-linux-gnu
730[CFG  ]    checking for a BSD-compatible install... /home/ubuntu/build/crosstool-ng/ct-ng-final/.build/tools/bin/install -c
731[CFG  ]    checking whether build environment is sane... yes
732[CFG  ]    checking for a thread-safe mkdir -p... /bin/mkdir -p
733[CFG  ]    checking for gawk... gawk
734[CFG  ]    checking whether make sets $(MAKE)... yes
735[CFG  ]    checking whether to enable maintainer-specific portions of Makefiles... no
736[CFG  ]    checking ABI=32
737[CFG  ]    checking whether i686-build_pc-linux-gnu-gcc is gcc... yes
738[CFG  ]    checking compiler i686-build_pc-linux-gnu-gcc -O2 -g -pipe -m32 -fexceptions ... yes
739[CFG  ]    checking compiler i686-build_pc-linux-gnu-gcc -O2 -g -pipe -m32 -fexceptions has sizeof(long)==4... yes
740[CFG  ]    checking for i686-build_pc-linux-gnu-gcc... i686-build_pc-linux-gnu-gcc
741[CFG  ]    checking whether the C compiler works... yes
742[CFG  ]    checking for C compiler default output file name... a.out
743[CFG  ]    checking for suffix of executables...
744[CFG  ]    checking whether we are cross compiling... no
745[CFG  ]    checking for suffix of object files... o
746[CFG  ]    checking whether we are using the GNU C compiler... yes
747[CFG  ]    checking whether i686-build_pc-linux-gnu-gcc accepts -g... yes
748[CFG  ]    checking for i686-build_pc-linux-gnu-gcc option to accept ISO C89... none needed
749[CFG  ]    checking for i686-build_pc-linux-gnu-gcc option to accept ISO C99... -std=gnu99
750[CFG  ]    checking for i686-build_pc-linux-gnu-gcc -std=gnu99 option to accept ISO Standard C... (cached) -std=gnu99
751[CFG  ]    checking how to run the C preprocessor... i686-build_pc-linux-gnu-gcc -std=gnu99 -E
752[CFG  ]    checking build system compiler i686-build_pc-linux-gnu-gcc -std=gnu99... yes
753[CFG  ]    checking for build system preprocessor... i686-build_pc-linux-gnu-gcc -std=gnu99 -E
754[CFG  ]    checking for build system executable suffix...
755[CFG  ]    checking whether build system compiler is ANSI... yes
756[CFG  ]    checking for build system compiler math library... -lm
757[CFG  ]    checking whether we are using the GNU C++ compiler... yes
758[CFG  ]    checking whether i686-build_pc-linux-gnu-g++ accepts -g... yes
759[CFG  ]    checking C++ compiler i686-build_pc-linux-gnu-g++  -O2 -g -pipe -m32 -fexceptions... yes
760[CFG  ]    checking how to run the C++ preprocessor... i686-build_pc-linux-gnu-g++ -E
761[CFG  ]    checking for grep that handles long lines and -e... /home/ubuntu/build/crosstool-ng/ct-ng-final/.build/tools/bin/grep
762[CFG  ]    checking for egrep... /home/ubuntu/build/crosstool-ng/ct-ng-final/.build/tools/bin/grep -E
763[CFG  ]    using ABI="32"
764[CFG  ]          CC="i686-build_pc-linux-gnu-gcc -std=gnu99"
765[CFG  ]          CFLAGS="-O2 -g -pipe -m32 -fexceptions"
766[CFG  ]          CPPFLAGS=""
767[CFG  ]          CXX="i686-build_pc-linux-gnu-g++"
768[CFG  ]          CXXFLAGS="-O2 -g -pipe -m32 -fexceptions"
769[CFG  ]          MPN_PATH=" x86/p6 x86 generic"
770[CFG  ]    checking whether assembler supports --noexecstack option... yes
771[CFG  ]    checking for i686-build_pc-linux-gnu-ar... i686-build_pc-linux-gnu-ar
772[CFG  ]    checking for BSD- or MS-compatible name lister (nm)... i686-build_pc-linux-gnu-nm
773[CFG  ]    checking the name lister (i686-build_pc-linux-gnu-nm) interface... BSD nm
774[CFG  ]    checking how to print strings... printf
775[CFG  ]    checking for a sed that does not truncate output... /home/ubuntu/build/crosstool-ng/ct-ng-final/.build/tools/bin/sed
776[CFG  ]    checking for fgrep... /home/ubuntu/build/crosstool-ng/ct-ng-final/.build/tools/bin/grep -F
777[CFG  ]    checking for ld used by i686-build_pc-linux-gnu-gcc -std=gnu99... i686-build_pc-linux-gnu-ld
778[CFG  ]    checking if the linker (i686-build_pc-linux-gnu-ld) is GNU ld... yes
779[CFG  ]    checking whether ln -s works... yes
780[CFG  ]    checking the maximum length of command line arguments... 805306365
781[CFG  ]    checking whether the shell understands some XSI constructs... yes
782[CFG  ]    checking whether the shell understands "+="... yes
783[CFG  ]    checking how to convert i686-build_pc-linux-gnu file names to i686-build_pc-linux-gnu format... func_convert_file_noop
784[CFG  ]    checking how to convert i686-build_pc-linux-gnu file names to toolchain format... func_convert_file_noop
785[CFG  ]    checking for i686-build_pc-linux-gnu-ld option to reload object files... -r
786[CFG  ]    checking for i686-build_pc-linux-gnu-objdump... i686-build_pc-linux-gnu-objdump
787[CFG  ]    checking how to recognize dependent libraries... pass_all
788[CFG  ]    checking for i686-build_pc-linux-gnu-dlltool... dlltool
789[CFG  ]    checking how to associate runtime and link libraries... printf %sn
790[CFG  ]    checking for i686-build_pc-linux-gnu-ar... (cached) i686-build_pc-linux-gnu-ar
791[CFG  ]    checking for archiver @FILE support... @
792[CFG  ]    checking for i686-build_pc-linux-gnu-strip... i686-build_pc-linux-gnu-strip
793[CFG  ]    checking for i686-build_pc-linux-gnu-ranlib... i686-build_pc-linux-gnu-ranlib
794[CFG  ]    checking command to parse i686-build_pc-linux-gnu-nm output from i686-build_pc-linux-gnu-gcc -std=gnu99 object... ok
795[CFG  ]    checking for sysroot... no
796[CFG  ]    checking for i686-build_pc-linux-gnu-mt... no
797[CFG  ]    checking for mt... mt
798[CFG  ]    checking if mt is a manifest tool... no
799[CFG  ]    checking for ANSI C header files... yes
800[CFG  ]    checking for sys/types.h... yes
801[CFG  ]    checking for sys/stat.h... yes
802[CFG  ]    checking for stdlib.h... yes
803[CFG  ]    checking for string.h... yes
804[CFG  ]    checking for memory.h... yes
805[CFG  ]    checking for strings.h... yes
806[CFG  ]    checking for inttypes.h... yes
807[CFG  ]    checking for stdint.h... yes
808[CFG  ]    checking for unistd.h... yes
809[CFG  ]    checking for dlfcn.h... yes
810[CFG  ]    checking for objdir... .libs
811[CFG  ]    checking if i686-build_pc-linux-gnu-gcc -std=gnu99 supports -fno-rtti -fno-exceptions... no
812[CFG  ]    checking for i686-build_pc-linux-gnu-gcc -std=gnu99 option to produce PIC... -fPIC -DPIC
813[CFG  ]    checking if i686-build_pc-linux-gnu-gcc -std=gnu99 PIC flag -fPIC -DPIC works... yes
814[CFG  ]    checking if i686-build_pc-linux-gnu-gcc -std=gnu99 static flag -static works... yes
815[CFG  ]    checking if i686-build_pc-linux-gnu-gcc -std=gnu99 supports -c -o file.o... yes
816[CFG  ]    checking if i686-build_pc-linux-gnu-gcc -std=gnu99 supports -c -o file.o... (cached) yes
817[CFG  ]    checking whether the i686-build_pc-linux-gnu-gcc -std=gnu99 linker (i686-build_pc-linux-gnu-ld) supports shared libraries... yes
818[CFG  ]    checking dynamic linker characteristics... GNU/Linux ld.so
819[CFG  ]    checking how to hardcode library paths into programs... immediate
820[CFG  ]    checking whether stripping libraries is possible... yes
821[CFG  ]    checking if libtool supports shared libraries... yes
822[CFG  ]    checking whether to build shared libraries... no
823[CFG  ]    checking whether to build static libraries... yes
824[CFG  ]    checking how to run the C++ preprocessor... i686-build_pc-linux-gnu-g++ -E
825[CFG  ]    checking for ld used by i686-build_pc-linux-gnu-g++... i686-build_pc-linux-gnu-ld
826[CFG  ]    checking if the linker (i686-build_pc-linux-gnu-ld) is GNU ld... yes
827[CFG  ]    checking whether the i686-build_pc-linux-gnu-g++ linker (i686-build_pc-linux-gnu-ld) supports shared libraries... yes
828[CFG  ]    checking for i686-build_pc-linux-gnu-g++ option to produce PIC... -fPIC -DPIC
829[CFG  ]    checking if i686-build_pc-linux-gnu-g++ PIC flag -fPIC -DPIC works... yes
830[CFG  ]    checking if i686-build_pc-linux-gnu-g++ static flag -static works... yes
831[CFG  ]    checking if i686-build_pc-linux-gnu-g++ supports -c -o file.o... yes
832[CFG  ]    checking if i686-build_pc-linux-gnu-g++ supports -c -o file.o... (cached) yes
833[CFG  ]    checking whether the i686-build_pc-linux-gnu-g++ linker (i686-build_pc-linux-gnu-ld) supports shared libraries... yes
834[CFG  ]    checking dynamic linker characteristics... (cached) GNU/Linux ld.so
835[CFG  ]    checking how to hardcode library paths into programs... immediate
836[CFG  ]    checking for ANSI C header files... (cached) yes
837[CFG  ]    checking whether time.h and sys/time.h may both be included... yes
838[CFG  ]    checking fcntl.h usability... yes
839[CFG  ]    checking fcntl.h presence... yes
840[CFG  ]    checking for fcntl.h... yes
841[CFG  ]    checking float.h usability... yes
842[CFG  ]    checking float.h presence... yes
843[CFG  ]    checking for float.h... yes
844[CFG  ]    checking invent.h usability... no
845[CFG  ]    checking invent.h presence... no
846[CFG  ]    checking for invent.h... no
847[CFG  ]    checking langinfo.h usability... yes
848[CFG  ]    checking langinfo.h presence... yes
849[CFG  ]    checking for langinfo.h... yes
850[CFG  ]    checking locale.h usability... yes
851[CFG  ]    checking locale.h presence... yes
852[CFG  ]    checking for locale.h... yes
853[CFG  ]    checking nl_types.h usability... yes
854[CFG  ]    checking nl_types.h presence... yes
855[CFG  ]    checking for nl_types.h... yes
856[CFG  ]    checking sys/attributes.h usability... no
857[CFG  ]    checking sys/attributes.h presence... no
858[CFG  ]    checking for sys/attributes.h... no
859[CFG  ]    checking sys/iograph.h usability... no
860[CFG  ]    checking sys/iograph.h presence... no
861[CFG  ]    checking for sys/iograph.h... no
862[CFG  ]    checking sys/mman.h usability... yes
863[CFG  ]    checking sys/mman.h presence... yes
864[CFG  ]    checking for sys/mman.h... yes
865[CFG  ]    checking sys/param.h usability... yes
866[CFG  ]    checking sys/param.h presence... yes
867[CFG  ]    checking for sys/param.h... yes
868[CFG  ]    checking sys/processor.h usability... no
869[CFG  ]    checking sys/processor.h presence... no
870[CFG  ]    checking for sys/processor.h... no
871[CFG  ]    checking sys/pstat.h usability... no
872[CFG  ]    checking sys/pstat.h presence... no
873[CFG  ]    checking for sys/pstat.h... no
874[CFG  ]    checking sys/sysinfo.h usability... yes
875[CFG  ]    checking sys/sysinfo.h presence... yes
876[CFG  ]    checking for sys/sysinfo.h... yes
877[CFG  ]    checking sys/syssgi.h usability... no
878[CFG  ]    checking sys/syssgi.h presence... no
879[CFG  ]    checking for sys/syssgi.h... no
880[CFG  ]    checking sys/systemcfg.h usability... no
881[CFG  ]    checking sys/systemcfg.h presence... no
882[CFG  ]    checking for sys/systemcfg.h... no
883[CFG  ]    checking sys/time.h usability... yes
884[CFG  ]    checking sys/time.h presence... yes
885[CFG  ]    checking for sys/time.h... yes
886[CFG  ]    checking sys/times.h usability... yes
887[CFG  ]    checking sys/times.h presence... yes
888[CFG  ]    checking for sys/times.h... yes
889[CFG  ]    checking for sys/resource.h... yes
890[CFG  ]    checking for sys/sysctl.h... yes
891[CFG  ]    checking for machine/hal_sysinfo.h... no
892[CFG  ]    checking whether fgetc is declared... yes
893[CFG  ]    checking whether fscanf is declared... yes
894[CFG  ]    checking whether optarg is declared... yes
895[CFG  ]    checking whether ungetc is declared... yes
896[CFG  ]    checking whether vfprintf is declared... yes
897[CFG  ]    checking whether sys_errlist is declared... yes
898[CFG  ]    checking whether sys_nerr is declared... yes
899[CFG  ]    checking return type of signal handlers... void
900[CFG  ]    checking for intmax_t... yes
901[CFG  ]    checking for long double... yes
902[CFG  ]    checking for long long... yes
903[CFG  ]    checking for ptrdiff_t... yes
904[CFG  ]    checking for quad_t... yes
905[CFG  ]    checking for uint_least32_t... yes
906[CFG  ]    checking for intptr_t... yes
907[CFG  ]    checking for preprocessor stringizing operator... yes
908[CFG  ]    checking for working volatile... yes
909[CFG  ]    checking for C/C++ restrict keyword... __restrict
910[CFG  ]    checking whether <stdarg.h> exists and works... yes
911[CFG  ]    checking whether gcc __attribute__ ((const)) works... yes
912[CFG  ]    checking whether gcc __attribute__ ((malloc)) works... yes
913[CFG  ]    checking whether gcc __attribute__ ((mode (XX))) works... yes
914[CFG  ]    checking whether gcc __attribute__ ((noreturn)) works... yes
915[CFG  ]    checking for inline... inline
916[CFG  ]    checking for cos in -lm... yes
917[CFG  ]    checking for working alloca.h... yes
918[CFG  ]    checking for alloca (via gmp-impl.h)... yes
919[CFG  ]    checking how to allocate temporary memory... alloca
920[CFG  ]    checking whether byte ordering is bigendian... no
921[CFG  ]    checking format of `double' floating point... IEEE little endian
922[CFG  ]    checking for alarm... yes
923[CFG  ]    checking for attr_get... no
924[CFG  ]    checking for clock... yes
925[CFG  ]    checking for cputime... no
926[CFG  ]    checking for getpagesize... yes
927[CFG  ]    checking for getrusage... yes
928[CFG  ]    checking for gettimeofday... yes
929[CFG  ]    checking for getsysinfo... no
930[CFG  ]    checking for localeconv... yes
931[CFG  ]    checking for memset... yes
932[CFG  ]    checking for mmap... yes
933[CFG  ]    checking for mprotect... yes
934[CFG  ]    checking for nl_langinfo... yes
935[CFG  ]    checking for obstack_vprintf... yes
936[CFG  ]    checking for popen... yes
937[CFG  ]    checking for processor_info... no
938[CFG  ]    checking for pstat_getprocessor... no
939[CFG  ]    checking for raise... yes
940[CFG  ]    checking for read_real_time... no
941[CFG  ]    checking for sigaction... yes
942[CFG  ]    checking for sigaltstack... yes
943[CFG  ]    checking for sigstack... yes
944[CFG  ]    checking for syssgi... no
945[CFG  ]    checking for strchr... yes
946[CFG  ]    checking for strerror... yes
947[CFG  ]    checking for strnlen... yes
948[CFG  ]    checking for strtol... yes
949[CFG  ]    checking for strtoul... yes
950[CFG  ]    checking for sysconf... yes
951[CFG  ]    checking for sysctl... yes
952[CFG  ]    checking for sysctlbyname... no
953[CFG  ]    checking for times... yes
954[CFG  ]    checking for library containing clock_gettime... -lrt
955[CFG  ]    checking for vsnprintf... yes
956[CFG  ]    checking whether vsnprintf works... yes
957[CFG  ]    checking whether sscanf needs writable input... no
958[CFG  ]    checking for struct pst_processor.psp_iticksperclktick... no
959[CFG  ]    checking sstream usability... yes
960[CFG  ]    checking sstream presence... yes
961[CFG  ]    checking for sstream... yes
962[CFG  ]    checking for std::locale... yes
963[CFG  ]    checking for suitable m4... m4
964[CFG  ]    checking if m4wrap produces spurious output... no
965[CFG  ]    checking how to switch to text section... .text
966[CFG  ]    checking how to switch to data section... .data
967[CFG  ]    checking for assembler label suffix... :
968[CFG  ]    checking for assembler global directive... .globl
969[CFG  ]    checking for assembler global directive attribute...
970[CFG  ]    checking if globals are prefixed by underscore... no
971[CFG  ]    checking how to switch to read-only data section...  .section        .rodata
972[CFG  ]    checking for assembler .type directive... .type      $1,@$2
973[CFG  ]    checking for assembler .size directive... .size      $1,$2
974[CFG  ]    checking for assembler local label prefix... .L
975[CFG  ]    checking for assembler byte directive... .byte
976[CFG  ]    checking how to define a 32-bit word... .long
977[CFG  ]    checking if .align assembly directive is logarithmic... no
978[CFG  ]    checking if the .align directive accepts an 0x90 fill in .text... yes
979[CFG  ]    checking for assembler COFF type directives... no
980[CFG  ]    checking if _GLOBAL_OFFSET_TABLE_ is prefixed by underscore... no
981[CFG  ]    checking if the assembler takes cl with shldl... yes
982[CFG  ]    checking size of void *... 4
983[CFG  ]    checking size of unsigned short... 2
984[CFG  ]    checking size of unsigned... 4
985[CFG  ]    checking size of unsigned long... 4
986[CFG  ]    checking size of mp_limb_t... 4
987[CFG  ]    checking for stack_t... yes
988[CFG  ]    checking for tputs in -lncurses... yes
989[CFG  ]    checking for readline in -lreadline... no
990[CFG  ]    checking readline detected... no
991[CFG  ]    checking for bison... bison -y
992[CFG  ]    checking for flex... flex
993[CFG  ]    checking lex output file root... lex.yy
994[CFG  ]    checking lex library... -lfl
995[CFG  ]    checking whether yytext is a pointer... yes
996[CFG  ]    checking for i686-build_pc-linux-gnu-ranlib... (cached) i686-build_pc-linux-gnu-ranlib
997[CFG  ]    creating config.m4
998[CFG  ]    configure: creating ./config.status
999[CFG  ]    config.status: creating demos/pexpr-config.h
1000[CFG  ]    config.status: creating demos/calc/calc-config.h
1001[CFG  ]    config.status: creating Makefile
1002[CFG  ]    config.status: creating mpf/Makefile
1003[CFG  ]    config.status: creating mpn/Makefile
1004[CFG  ]    config.status: creating mpq/Makefile
1005[CFG  ]    config.status: creating mpz/Makefile
1006[CFG  ]    config.status: creating printf/Makefile
1007[CFG  ]    config.status: creating scanf/Makefile
1008[CFG  ]    config.status: creating rand/Makefile
1009[CFG  ]    config.status: creating cxx/Makefile
1010[CFG  ]    config.status: creating tests/Makefile
1011[CFG  ]    config.status: creating tests/devel/Makefile
1012[CFG  ]    config.status: creating tests/mpf/Makefile
1013[CFG  ]    config.status: creating tests/mpn/Makefile
1014[CFG  ]    config.status: creating tests/mpq/Makefile
1015[CFG  ]    config.status: creating tests/mpz/Makefile
1016[CFG  ]    config.status: creating tests/rand/Makefile
1017[CFG  ]    config.status: creating tests/misc/Makefile
1018[CFG  ]    config.status: creating tests/cxx/Makefile
1019[CFG  ]    config.status: creating doc/Makefile
1020[CFG  ]    config.status: creating tune/Makefile
1021[CFG  ]    config.status: creating demos/Makefile
1022[CFG  ]    config.status: creating demos/calc/Makefile
1023[CFG  ]    config.status: creating demos/expr/Makefile
1024[CFG  ]    config.status: creating gmp.h
1025[CFG  ]    config.status: creating config.h
1026[CFG  ]    config.status: linking /home/ubuntu/build/crosstool-ng/ct-ng-final/.build/src/gmp-5.1.1/mpn/generic/add.c to mpn/add.c
1027[CFG  ]    config.status: linking /home/ubuntu/build/crosstool-ng/ct-ng-final/.build/src/gmp-5.1.1/mpn/generic/add_1.c to mpn/add_1.c
1028[CFG  ]    config.status: linking /home/ubuntu/build/crosstool-ng/ct-ng-final/.build/src/gmp-5.1.1/mpn/x86/p6/aors_n.asm to mpn/add_n.asm
1029[CFG  ]    config.status: linking /home/ubuntu/build/crosstool-ng/ct-ng-final/.build/src/gmp-5.1.1/mpn/generic/sub.c to mpn/sub.c
1030[CFG  ]    config.status: linking /home/ubuntu/build/crosstool-ng/ct-ng-final/.build/src/gmp-5.1.1/mpn/generic/sub_1.c to mpn/sub_1.c
1031[CFG  ]    config.status: linking /home/ubuntu/build/crosstool-ng/ct-ng-final/.build/src/gmp-5.1.1/mpn/x86/p6/aors_n.asm to mpn/sub_n.asm
1032[CFG  ]    config.status: linking /home/ubuntu/build/crosstool-ng/ct-ng-final/.build/src/gmp-5.1.1/mpn/generic/addcnd_n.c to mpn/addcnd_n.c
1033[CFG  ]    config.status: linking /home/ubuntu/build/crosstool-ng/ct-ng-final/.build/src/gmp-5.1.1/mpn/generic/subcnd_n.c to mpn/subcnd_n.c
1034[CFG  ]    config.status: linking /home/ubuntu/build/crosstool-ng/ct-ng-final/.build/src/gmp-5.1.1/mpn/generic/neg.c to mpn/neg.c
1035[CFG  ]    config.status: linking /home/ubuntu/build/crosstool-ng/ct-ng-final/.build/src/gmp-5.1.1/mpn/generic/com.c to mpn/com.c
1036[CFG  ]    config.status: linking /home/ubuntu/build/crosstool-ng/ct-ng-final/.build/src/gmp-5.1.1/mpn/x86/mul_1.asm to mpn/mul_1.asm
1037[CFG  ]    config.status: linking /home/ubuntu/build/crosstool-ng/ct-ng-final/.build/src/gmp-5.1.1/mpn/x86/p6/aorsmul_1.asm to mpn/addmul_1.asm
1038[CFG  ]    config.status: linking /home/ubuntu/build/crosstool-ng/ct-ng-final/.build/src/gmp-5.1.1/mpn/x86/p6/aorsmul_1.asm to mpn/submul_1.asm
1039[CFG  ]    config.status: linking /home/ubuntu/build/crosstool-ng/ct-ng-final/.build/src/gmp-5.1.1/mpn/generic/add_err1_n.c to mpn/add_err1_n.c
1040[CFG  ]    config.status: linking /home/ubuntu/build/crosstool-ng/ct-ng-final/.build/src/gmp-5.1.1/mpn/generic/add_err2_n.c to mpn/add_err2_n.c
1041[CFG  ]    config.status: linking /home/ubuntu/build/crosstool-ng/ct-ng-final/.build/src/gmp-5.1.1/mpn/generic/add_err3_n.c to mpn/add_err3_n.c
1042[CFG  ]    config.status: linking /home/ubuntu/build/crosstool-ng/ct-ng-final/.build/src/gmp-5.1.1/mpn/generic/sub_err1_n.c to mpn/sub_err1_n.c
1043[CFG  ]    config.status: linking /home/ubuntu/build/crosstool-ng/ct-ng-final/.build/src/gmp-5.1.1/mpn/generic/sub_err2_n.c to mpn/sub_err2_n.c
1044[CFG  ]    config.status: linking /home/ubuntu/build/crosstool-ng/ct-ng-final/.build/src/gmp-5.1.1/mpn/generic/sub_err3_n.c to mpn/sub_err3_n.c
1045[CFG  ]    config.status: linking /home/ubuntu/build/crosstool-ng/ct-ng-final/.build/src/gmp-5.1.1/mpn/x86/lshift.asm to mpn/lshift.asm
1046[CFG  ]    config.status: linking /home/ubuntu/build/crosstool-ng/ct-ng-final/.build/src/gmp-5.1.1/mpn/x86/rshift.asm to mpn/rshift.asm
1047[CFG  ]    config.status: linking /home/ubuntu/build/crosstool-ng/ct-ng-final/.build/src/gmp-5.1.1/mpn/x86/p6/dive_1.asm to mpn/dive_1.asm
1048[CFG  ]    config.status: linking /home/ubuntu/build/crosstool-ng/ct-ng-final/.build/src/gmp-5.1.1/mpn/generic/diveby3.c to mpn/diveby3.c
1049[CFG  ]    config.status: linking /home/ubuntu/build/crosstool-ng/ct-ng-final/.build/src/gmp-5.1.1/mpn/generic/divis.c to mpn/divis.c
1050[CFG  ]    config.status: linking /home/ubuntu/build/crosstool-ng/ct-ng-final/.build/src/gmp-5.1.1/mpn/generic/divrem.c to mpn/divrem.c
1051[CFG  ]    config.status: linking /home/ubuntu/build/crosstool-ng/ct-ng-final/.build/src/gmp-5.1.1/mpn/x86/divrem_1.asm to mpn/divrem_1.asm
1052[CFG  ]    config.status: linking /home/ubuntu/build/crosstool-ng/ct-ng-final/.build/src/gmp-5.1.1/mpn/x86/divrem_2.asm to mpn/divrem_2.asm
1053[CFG  ]    config.status: linking /home/ubuntu/build/crosstool-ng/ct-ng-final/.build/src/gmp-5.1.1/mpn/generic/fib2_ui.c to mpn/fib2_ui.c
1054[CFG  ]    config.status: linking /home/ubuntu/build/crosstool-ng/ct-ng-final/.build/src/gmp-5.1.1/mpn/generic/mod_1.c to mpn/mod_1.c
1055[CFG  ]    config.status: linking /home/ubuntu/build/crosstool-ng/ct-ng-final/.build/src/gmp-5.1.1/mpn/x86/p6/mod_34lsub1.asm to mpn/mod_34lsub1.asm
1056[CFG  ]    config.status: linking /home/ubuntu/build/crosstool-ng/ct-ng-final/.build/src/gmp-5.1.1/mpn/x86/p6/mode1o.asm to mpn/mode1o.asm
1057[CFG  ]    config.status: linking /home/ubuntu/build/crosstool-ng/ct-ng-final/.build/src/gmp-5.1.1/mpn/generic/pre_divrem_1.c to mpn/pre_divrem_1.c
1058[CFG  ]    config.status: linking /home/ubuntu/build/crosstool-ng/ct-ng-final/.build/src/gmp-5.1.1/mpn/generic/pre_mod_1.c to mpn/pre_mod_1.c
1059[CFG  ]    config.status: linking /home/ubuntu/build/crosstool-ng/ct-ng-final/.build/src/gmp-5.1.1/mpn/generic/dump.c to mpn/dump.c
1060[CFG  ]    config.status: linking /home/ubuntu/build/crosstool-ng/ct-ng-final/.build/src/gmp-5.1.1/mpn/generic/mod_1_1.c to mpn/mod_1_1.c
1061[CFG  ]    config.status: linking /home/ubuntu/build/crosstool-ng/ct-ng-final/.build/src/gmp-5.1.1/mpn/generic/mod_1_2.c to mpn/mod_1_2.c
1062[CFG  ]    config.status: linking /home/ubuntu/build/crosstool-ng/ct-ng-final/.build/src/gmp-5.1.1/mpn/generic/mod_1_3.c to mpn/mod_1_3.c
1063[CFG  ]    config.status: linking /home/ubuntu/build/crosstool-ng/ct-ng-final/.build/src/gmp-5.1.1/mpn/generic/mod_1_4.c to mpn/mod_1_4.c
1064[CFG  ]    config.status: linking /home/ubuntu/build/crosstool-ng/ct-ng-final/.build/src/gmp-5.1.1/mpn/generic/lshiftc.c to mpn/lshiftc.c
1065[CFG  ]    config.status: linking /home/ubuntu/build/crosstool-ng/ct-ng-final/.build/src/gmp-5.1.1/mpn/generic/mul.c to mpn/mul.c
1066[CFG  ]    config.status: linking /home/ubuntu/build/crosstool-ng/ct-ng-final/.build/src/gmp-5.1.1/mpn/generic/mul_fft.c to mpn/mul_fft.c
1067[CFG  ]    config.status: linking /home/ubuntu/build/crosstool-ng/ct-ng-final/.build/src/gmp-5.1.1/mpn/generic/mul_n.c to mpn/mul_n.c
1068[CFG  ]    config.status: linking /home/ubuntu/build/crosstool-ng/ct-ng-final/.build/src/gmp-5.1.1/mpn/generic/sqr.c to mpn/sqr.c
1069[CFG  ]    config.status: linking /home/ubuntu/build/crosstool-ng/ct-ng-final/.build/src/gmp-5.1.1/mpn/x86/p6/mul_basecase.asm to mpn/mul_basecase.asm
1070[CFG  ]    config.status: linking /home/ubuntu/build/crosstool-ng/ct-ng-final/.build/src/gmp-5.1.1/mpn/x86/p6/sqr_basecase.asm to mpn/sqr_basecase.asm
1071[CFG  ]    config.status: linking /home/ubuntu/build/crosstool-ng/ct-ng-final/.build/src/gmp-5.1.1/mpn/generic/nussbaumer_mul.c to mpn/nussbaumer_mul.c
1072[CFG  ]    config.status: linking /home/ubuntu/build/crosstool-ng/ct-ng-final/.build/src/gmp-5.1.1/mpn/generic/mulmid_basecase.c to mpn/mulmid_basecase.c
1073[CFG  ]    config.status: linking /home/ubuntu/build/crosstool-ng/ct-ng-final/.build/src/gmp-5.1.1/mpn/generic/toom42_mulmid.c to mpn/toom42_mulmid.c
1074[CFG  ]    config.status: linking /home/ubuntu/build/crosstool-ng/ct-ng-final/.build/src/gmp-5.1.1/mpn/generic/mulmid_n.c to mpn/mulmid_n.c
1075[CFG  ]    config.status: linking /home/ubuntu/build/crosstool-ng/ct-ng-final/.build/src/gmp-5.1.1/mpn/generic/mulmid.c to mpn/mulmid.c
1076[CFG  ]    config.status: linking /home/ubuntu/build/crosstool-ng/ct-ng-final/.build/src/gmp-5.1.1/mpn/generic/random.c to mpn/random.c
1077[CFG  ]    config.status: linking /home/ubuntu/build/crosstool-ng/ct-ng-final/.build/src/gmp-5.1.1/mpn/generic/random2.c to mpn/random2.c
1078[CFG  ]    config.status: linking /home/ubuntu/build/crosstool-ng/ct-ng-final/.build/src/gmp-5.1.1/mpn/generic/pow_1.c to mpn/pow_1.c
1079[CFG  ]    config.status: linking /home/ubuntu/build/crosstool-ng/ct-ng-final/.build/src/gmp-5.1.1/mpn/generic/rootrem.c to mpn/rootrem.c
1080[CFG  ]    config.status: linking /home/ubuntu/build/crosstool-ng/ct-ng-final/.build/src/gmp-5.1.1/mpn/generic/sqrtrem.c to mpn/sqrtrem.c
1081[CFG  ]    config.status: linking /home/ubuntu/build/crosstool-ng/ct-ng-final/.build/src/gmp-5.1.1/mpn/generic/get_str.c to mpn/get_str.c
1082[CFG  ]    config.status: linking /home/ubuntu/build/crosstool-ng/ct-ng-final/.build/src/gmp-5.1.1/mpn/generic/set_str.c to mpn/set_str.c
1083[CFG  ]    config.status: linking /home/ubuntu/build/crosstool-ng/ct-ng-final/.build/src/gmp-5.1.1/mpn/generic/scan0.c to mpn/scan0.c
1084[CFG  ]    config.status: linking /home/ubuntu/build/crosstool-ng/ct-ng-final/.build/src/gmp-5.1.1/mpn/generic/scan1.c to mpn/scan1.c
1085[CFG  ]    config.status: linking /home/ubuntu/build/crosstool-ng/ct-ng-final/.build/src/gmp-5.1.1/mpn/generic/popham.c to mpn/popcount.c
1086[CFG  ]    config.status: linking /home/ubuntu/build/crosstool-ng/ct-ng-final/.build/src/gmp-5.1.1/mpn/generic/popham.c to mpn/hamdist.c
1087[CFG  ]    config.status: linking /home/ubuntu/build/crosstool-ng/ct-ng-final/.build/src/gmp-5.1.1/mpn/generic/cmp.c to mpn/cmp.c
1088[CFG  ]    config.status: linking /home/ubuntu/build/crosstool-ng/ct-ng-final/.build/src/gmp-5.1.1/mpn/generic/perfsqr.c to mpn/perfsqr.c
1089[CFG  ]    config.status: linking /home/ubuntu/build/crosstool-ng/ct-ng-final/.build/src/gmp-5.1.1/mpn/generic/perfpow.c to mpn/perfpow.c
1090[CFG  ]    config.status: linking /home/ubuntu/build/crosstool-ng/ct-ng-final/.build/src/gmp-5.1.1/mpn/x86/p6/gcd_1.asm to mpn/gcd_1.asm
1091[CFG  ]    config.status: linking /home/ubuntu/build/crosstool-ng/ct-ng-final/.build/src/gmp-5.1.1/mpn/generic/gcd.c to mpn/gcd.c
1092[CFG  ]    config.status: linking /home/ubuntu/build/crosstool-ng/ct-ng-final/.build/src/gmp-5.1.1/mpn/generic/gcdext_1.c to mpn/gcdext_1.c
1093[CFG  ]    config.status: linking /home/ubuntu/build/crosstool-ng/ct-ng-final/.build/src/gmp-5.1.1/mpn/generic/gcdext.c to mpn/gcdext.c
1094[CFG  ]    config.status: linking /home/ubuntu/build/crosstool-ng/ct-ng-final/.build/src/gmp-5.1.1/mpn/generic/gcd_subdiv_step.c to mpn/gcd_subdiv_step.c
1095[CFG  ]    config.status: linking /home/ubuntu/build/crosstool-ng/ct-ng-final/.build/src/gmp-5.1.1/mpn/generic/gcdext_lehmer.c to mpn/gcdext_lehmer.c
1096[CFG  ]    config.status: linking /home/ubuntu/build/crosstool-ng/ct-ng-final/.build/src/gmp-5.1.1/mpn/generic/div_q.c to mpn/div_q.c
1097[CFG  ]    config.status: linking /home/ubuntu/build/crosstool-ng/ct-ng-final/.build/src/gmp-5.1.1/mpn/generic/tdiv_qr.c to mpn/tdiv_qr.c
1098[CFG  ]    config.status: linking /home/ubuntu/build/crosstool-ng/ct-ng-final/.build/src/gmp-5.1.1/mpn/generic/jacbase.c to mpn/jacbase.c
1099[CFG  ]    config.status: linking /home/ubuntu/build/crosstool-ng/ct-ng-final/.build/src/gmp-5.1.1/mpn/generic/jacobi_2.c to mpn/jacobi_2.c
1100[CFG  ]    config.status: linking /home/ubuntu/build/crosstool-ng/ct-ng-final/.build/src/gmp-5.1.1/mpn/generic/jacobi.c to mpn/jacobi.c
1101[CFG  ]    config.status: linking /home/ubuntu/build/crosstool-ng/ct-ng-final/.build/src/gmp-5.1.1/mpn/generic/get_d.c to mpn/get_d.c
1102[CFG  ]    config.status: linking /home/ubuntu/build/crosstool-ng/ct-ng-final/.build/src/gmp-5.1.1/mpn/generic/matrix22_mul.c to mpn/matrix22_mul.c
1103[CFG  ]    config.status: linking /home/ubuntu/build/crosstool-ng/ct-ng-final/.build/src/gmp-5.1.1/mpn/generic/matrix22_mul1_inverse_vector.c to mpn/matrix22_mul1_inverse_vector.c
1104[CFG  ]    config.status: linking /home/ubuntu/build/crosstool-ng/ct-ng-final/.build/src/gmp-5.1.1/mpn/generic/hgcd_matrix.c to mpn/hgcd_matrix.c
1105[CFG  ]    config.status: linking /home/ubuntu/build/crosstool-ng/ct-ng-final/.build/src/gmp-5.1.1/mpn/generic/hgcd2.c to mpn/hgcd2.c
1106[CFG  ]    config.status: linking /home/ubuntu/build/crosstool-ng/ct-ng-final/.build/src/gmp-5.1.1/mpn/generic/hgcd_step.c to mpn/hgcd_step.c
1107[CFG  ]    config.status: linking /home/ubuntu/build/crosstool-ng/ct-ng-final/.build/src/gmp-5.1.1/mpn/generic/hgcd_reduce.c to mpn/hgcd_reduce.c
1108[CFG  ]    config.status: linking /home/ubuntu/build/crosstool-ng/ct-ng-final/.build/src/gmp-5.1.1/mpn/generic/hgcd.c to mpn/hgcd.c
1109[CFG  ]    config.status: linking /home/ubuntu/build/crosstool-ng/ct-ng-final/.build/src/gmp-5.1.1/mpn/generic/hgcd_appr.c to mpn/hgcd_appr.c
1110[CFG  ]    config.status: linking /home/ubuntu/build/crosstool-ng/ct-ng-final/.build/src/gmp-5.1.1/mpn/generic/hgcd2_jacobi.c to mpn/hgcd2_jacobi.c
1111[CFG  ]    config.status: linking /home/ubuntu/build/crosstool-ng/ct-ng-final/.build/src/gmp-5.1.1/mpn/generic/hgcd_jacobi.c to mpn/hgcd_jacobi.c
1112[CFG  ]    config.status: linking /home/ubuntu/build/crosstool-ng/ct-ng-final/.build/src/gmp-5.1.1/mpn/generic/mullo_n.c to mpn/mullo_n.c
1113[CFG  ]    config.status: linking /home/ubuntu/build/crosstool-ng/ct-ng-final/.build/src/gmp-5.1.1/mpn/generic/mullo_basecase.c to mpn/mullo_basecase.c
1114[CFG  ]    config.status: linking /home/ubuntu/build/crosstool-ng/ct-ng-final/.build/src/gmp-5.1.1/mpn/generic/toom22_mul.c to mpn/toom22_mul.c
1115[CFG  ]    config.status: linking /home/ubuntu/build/crosstool-ng/ct-ng-final/.build/src/gmp-5.1.1/mpn/generic/toom32_mul.c to mpn/toom32_mul.c
1116[CFG  ]    config.status: linking /home/ubuntu/build/crosstool-ng/ct-ng-final/.build/src/gmp-5.1.1/mpn/generic/toom42_mul.c to mpn/toom42_mul.c
1117[CFG  ]    config.status: linking /home/ubuntu/build/crosstool-ng/ct-ng-final/.build/src/gmp-5.1.1/mpn/generic/toom52_mul.c to mpn/toom52_mul.c
1118[CFG  ]    config.status: linking /home/ubuntu/build/crosstool-ng/ct-ng-final/.build/src/gmp-5.1.1/mpn/generic/toom62_mul.c to mpn/toom62_mul.c
1119[CFG  ]    config.status: linking /home/ubuntu/build/crosstool-ng/ct-ng-final/.build/src/gmp-5.1.1/mpn/generic/toom33_mul.c to mpn/toom33_mul.c
1120[CFG  ]    config.status: linking /home/ubuntu/build/crosstool-ng/ct-ng-final/.build/src/gmp-5.1.1/mpn/generic/toom43_mul.c to mpn/toom43_mul.c
1121[CFG  ]    config.status: linking /home/ubuntu/build/crosstool-ng/ct-ng-final/.build/src/gmp-5.1.1/mpn/generic/toom53_mul.c to mpn/toom53_mul.c
1122[CFG  ]    config.status: linking /home/ubuntu/build/crosstool-ng/ct-ng-final/.build/src/gmp-5.1.1/mpn/generic/toom54_mul.c to mpn/toom54_mul.c
1123[CFG  ]    config.status: linking /home/ubuntu/build/crosstool-ng/ct-ng-final/.build/src/gmp-5.1.1/mpn/generic/toom63_mul.c to mpn/toom63_mul.c
1124[CFG  ]    config.status: linking /home/ubuntu/build/crosstool-ng/ct-ng-final/.build/src/gmp-5.1.1/mpn/generic/toom44_mul.c to mpn/toom44_mul.c
1125[CFG  ]    config.status: linking /home/ubuntu/build/crosstool-ng/ct-ng-final/.build/src/gmp-5.1.1/mpn/generic/toom6h_mul.c to mpn/toom6h_mul.c
1126[CFG  ]    config.status: linking /home/ubuntu/build/crosstool-ng/ct-ng-final/.build/src/gmp-5.1.1/mpn/generic/toom6_sqr.c to mpn/toom6_sqr.c
1127[CFG  ]    config.status: linking /home/ubuntu/build/crosstool-ng/ct-ng-final/.build/src/gmp-5.1.1/mpn/generic/toom8h_mul.c to mpn/toom8h_mul.c
1128[CFG  ]    config.status: linking /home/ubuntu/build/crosstool-ng/ct-ng-final/.build/src/gmp-5.1.1/mpn/generic/toom8_sqr.c to mpn/toom8_sqr.c
1129[CFG  ]    config.status: linking /home/ubuntu/build/crosstool-ng/ct-ng-final/.build/src/gmp-5.1.1/mpn/generic/toom_couple_handling.c to mpn/toom_couple_handling.c
1130[CFG  ]    config.status: linking /home/ubuntu/build/crosstool-ng/ct-ng-final/.build/src/gmp-5.1.1/mpn/generic/toom2_sqr.c to mpn/toom2_sqr.c
1131[CFG  ]    config.status: linking /home/ubuntu/build/crosstool-ng/ct-ng-final/.build/src/gmp-5.1.1/mpn/generic/toom3_sqr.c to mpn/toom3_sqr.c
1132[CFG  ]    config.status: linking /home/ubuntu/build/crosstool-ng/ct-ng-final/.build/src/gmp-5.1.1/mpn/generic/toom4_sqr.c to mpn/toom4_sqr.c
1133[CFG  ]    config.status: linking /home/ubuntu/build/crosstool-ng/ct-ng-final/.build/src/gmp-5.1.1/mpn/generic/toom_eval_dgr3_pm1.c to mpn/toom_eval_dgr3_pm1.c
1134[CFG  ]    config.status: linking /home/ubuntu/build/crosstool-ng/ct-ng-final/.build/src/gmp-5.1.1/mpn/generic/toom_eval_dgr3_pm2.c to mpn/toom_eval_dgr3_pm2.c
1135[CFG  ]    config.status: linking /home/ubuntu/build/crosstool-ng/ct-ng-final/.build/src/gmp-5.1.1/mpn/generic/toom_eval_pm1.c to mpn/toom_eval_pm1.c
1136[CFG  ]    config.status: linking /home/ubuntu/build/crosstool-ng/ct-ng-final/.build/src/gmp-5.1.1/mpn/generic/toom_eval_pm2.c to mpn/toom_eval_pm2.c
1137[CFG  ]    config.status: linking /home/ubuntu/build/crosstool-ng/ct-ng-final/.build/src/gmp-5.1.1/mpn/generic/toom_eval_pm2exp.c to mpn/toom_eval_pm2exp.c
1138[CFG  ]    config.status: linking /home/ubuntu/build/crosstool-ng/ct-ng-final/.build/src/gmp-5.1.1/mpn/generic/toom_eval_pm2rexp.c to mpn/toom_eval_pm2rexp.c
1139[CFG  ]    config.status: linking /home/ubuntu/build/crosstool-ng/ct-ng-final/.build/src/gmp-5.1.1/mpn/generic/toom_interpolate_5pts.c to mpn/toom_interpolate_5pts.c
1140[CFG  ]    config.status: linking /home/ubuntu/build/crosstool-ng/ct-ng-final/.build/src/gmp-5.1.1/mpn/generic/toom_interpolate_6pts.c to mpn/toom_interpolate_6pts.c
1141[CFG  ]    config.status: linking /home/ubuntu/build/crosstool-ng/ct-ng-final/.build/src/gmp-5.1.1/mpn/generic/toom_interpolate_7pts.c to mpn/toom_interpolate_7pts.c
1142[CFG  ]    config.status: linking /home/ubuntu/build/crosstool-ng/ct-ng-final/.build/src/gmp-5.1.1/mpn/generic/toom_interpolate_8pts.c to mpn/toom_interpolate_8pts.c
1143[CFG  ]    config.status: linking /home/ubuntu/build/crosstool-ng/ct-ng-final/.build/src/gmp-5.1.1/mpn/generic/toom_interpolate_12pts.c to mpn/toom_interpolate_12pts.c
1144[CFG  ]    config.status: linking /home/ubuntu/build/crosstool-ng/ct-ng-final/.build/src/gmp-5.1.1/mpn/generic/toom_interpolate_16pts.c to mpn/toom_interpolate_16pts.c
1145[CFG  ]    config.status: linking /home/ubuntu/build/crosstool-ng/ct-ng-final/.build/src/gmp-5.1.1/mpn/generic/invertappr.c to mpn/invertappr.c
1146[CFG  ]    config.status: linking /home/ubuntu/build/crosstool-ng/ct-ng-final/.build/src/gmp-5.1.1/mpn/generic/invert.c to mpn/invert.c
1147[CFG  ]    config.status: linking /home/ubuntu/build/crosstool-ng/ct-ng-final/.build/src/gmp-5.1.1/mpn/generic/binvert.c to mpn/binvert.c
1148[CFG  ]    config.status: linking /home/ubuntu/build/crosstool-ng/ct-ng-final/.build/src/gmp-5.1.1/mpn/generic/mulmod_bnm1.c to mpn/mulmod_bnm1.c
1149[CFG  ]    config.status: linking /home/ubuntu/build/crosstool-ng/ct-ng-final/.build/src/gmp-5.1.1/mpn/generic/sqrmod_bnm1.c to mpn/sqrmod_bnm1.c
1150[CFG  ]    config.status: linking /home/ubuntu/build/crosstool-ng/ct-ng-final/.build/src/gmp-5.1.1/mpn/generic/div_qr_2.c to mpn/div_qr_2.c
1151[CFG  ]    config.status: linking /home/ubuntu/build/crosstool-ng/ct-ng-final/.build/src/gmp-5.1.1/mpn/generic/div_qr_2n_pi1.c to mpn/div_qr_2n_pi1.c
1152[CFG  ]    config.status: linking /home/ubuntu/build/crosstool-ng/ct-ng-final/.build/src/gmp-5.1.1/mpn/generic/div_qr_2u_pi1.c to mpn/div_qr_2u_pi1.c
1153[CFG  ]    config.status: linking /home/ubuntu/build/crosstool-ng/ct-ng-final/.build/src/gmp-5.1.1/mpn/generic/sbpi1_div_q.c to mpn/sbpi1_div_q.c
1154[CFG  ]    config.status: linking /home/ubuntu/build/crosstool-ng/ct-ng-final/.build/src/gmp-5.1.1/mpn/generic/sbpi1_div_qr.c to mpn/sbpi1_div_qr.c
1155[CFG  ]    config.status: linking /home/ubuntu/build/crosstool-ng/ct-ng-final/.build/src/gmp-5.1.1/mpn/generic/sbpi1_divappr_q.c to mpn/sbpi1_divappr_q.c
1156[CFG  ]    config.status: linking /home/ubuntu/build/crosstool-ng/ct-ng-final/.build/src/gmp-5.1.1/mpn/generic/dcpi1_div_q.c to mpn/dcpi1_div_q.c
1157[CFG  ]    config.status: linking /home/ubuntu/build/crosstool-ng/ct-ng-final/.build/src/gmp-5.1.1/mpn/generic/dcpi1_div_qr.c to mpn/dcpi1_div_qr.c
1158[CFG  ]    config.status: linking /home/ubuntu/build/crosstool-ng/ct-ng-final/.build/src/gmp-5.1.1/mpn/generic/dcpi1_divappr_q.c to mpn/dcpi1_divappr_q.c
1159[CFG  ]    config.status: linking /home/ubuntu/build/crosstool-ng/ct-ng-final/.build/src/gmp-5.1.1/mpn/generic/mu_div_qr.c to mpn/mu_div_qr.c
1160[CFG  ]    config.status: linking /home/ubuntu/build/crosstool-ng/ct-ng-final/.build/src/gmp-5.1.1/mpn/generic/mu_divappr_q.c to mpn/mu_divappr_q.c
1161[CFG  ]    config.status: linking /home/ubuntu/build/crosstool-ng/ct-ng-final/.build/src/gmp-5.1.1/mpn/generic/mu_div_q.c to mpn/mu_div_q.c
1162[CFG  ]    config.status: linking /home/ubuntu/build/crosstool-ng/ct-ng-final/.build/src/gmp-5.1.1/mpn/x86/p6/bdiv_q_1.asm to mpn/bdiv_q_1.asm
1163[CFG  ]    config.status: linking /home/ubuntu/build/crosstool-ng/ct-ng-final/.build/src/gmp-5.1.1/mpn/generic/sbpi1_bdiv_q.c to mpn/sbpi1_bdiv_q.c
1164[CFG  ]    config.status: linking /home/ubuntu/build/crosstool-ng/ct-ng-final/.build/src/gmp-5.1.1/mpn/generic/sbpi1_bdiv_qr.c to mpn/sbpi1_bdiv_qr.c
1165[CFG  ]    config.status: linking /home/ubuntu/build/crosstool-ng/ct-ng-final/.build/src/gmp-5.1.1/mpn/generic/dcpi1_bdiv_q.c to mpn/dcpi1_bdiv_q.c
1166[CFG  ]    config.status: linking /home/ubuntu/build/crosstool-ng/ct-ng-final/.build/src/gmp-5.1.1/mpn/generic/dcpi1_bdiv_qr.c to mpn/dcpi1_bdiv_qr.c
1167[CFG  ]    config.status: linking /home/ubuntu/build/crosstool-ng/ct-ng-final/.build/src/gmp-5.1.1/mpn/generic/mu_bdiv_q.c to mpn/mu_bdiv_q.c
1168[CFG  ]    config.status: linking /home/ubuntu/build/crosstool-ng/ct-ng-final/.build/src/gmp-5.1.1/mpn/generic/mu_bdiv_qr.c to mpn/mu_bdiv_qr.c
1169[CFG  ]    config.status: linking /home/ubuntu/build/crosstool-ng/ct-ng-final/.build/src/gmp-5.1.1/mpn/generic/bdiv_q.c to mpn/bdiv_q.c
1170[CFG  ]    config.status: linking /home/ubuntu/build/crosstool-ng/ct-ng-final/.build/src/gmp-5.1.1/mpn/generic/bdiv_qr.c to mpn/bdiv_qr.c
1171[CFG  ]    config.status: linking /home/ubuntu/build/crosstool-ng/ct-ng-final/.build/src/gmp-5.1.1/mpn/generic/broot.c to mpn/broot.c
1172[CFG  ]    config.status: linking /home/ubuntu/build/crosstool-ng/ct-ng-final/.build/src/gmp-5.1.1/mpn/generic/brootinv.c to mpn/brootinv.c
1173[CFG  ]    config.status: linking /home/ubuntu/build/crosstool-ng/ct-ng-final/.build/src/gmp-5.1.1/mpn/generic/bsqrt.c to mpn/bsqrt.c
1174[CFG  ]    config.status: linking /home/ubuntu/build/crosstool-ng/ct-ng-final/.build/src/gmp-5.1.1/mpn/generic/bsqrtinv.c to mpn/bsqrtinv.c
1175[CFG  ]    config.status: linking /home/ubuntu/build/crosstool-ng/ct-ng-final/.build/src/gmp-5.1.1/mpn/generic/divexact.c to mpn/divexact.c
1176[CFG  ]    config.status: linking /home/ubuntu/build/crosstool-ng/ct-ng-final/.build/src/gmp-5.1.1/mpn/x86/bdiv_dbm1c.asm to mpn/bdiv_dbm1c.asm
1177[CFG  ]    config.status: linking /home/ubuntu/build/crosstool-ng/ct-ng-final/.build/src/gmp-5.1.1/mpn/generic/redc_1.c to mpn/redc_1.c
1178[CFG  ]    config.status: linking /home/ubuntu/build/crosstool-ng/ct-ng-final/.build/src/gmp-5.1.1/mpn/generic/redc_2.c to mpn/redc_2.c
1179[CFG  ]    config.status: linking /home/ubuntu/build/crosstool-ng/ct-ng-final/.build/src/gmp-5.1.1/mpn/generic/redc_n.c to mpn/redc_n.c
1180[CFG  ]    config.status: linking /home/ubuntu/build/crosstool-ng/ct-ng-final/.build/src/gmp-5.1.1/mpn/generic/powm.c to mpn/powm.c
1181[CFG  ]    config.status: linking /home/ubuntu/build/crosstool-ng/ct-ng-final/.build/src/gmp-5.1.1/mpn/generic/powlo.c to mpn/powlo.c
1182[CFG  ]    config.status: linking /home/ubuntu/build/crosstool-ng/ct-ng-final/.build/src/gmp-5.1.1/mpn/generic/powm_sec.c to mpn/powm_sec.c
1183[CFG  ]    config.status: linking /home/ubuntu/build/crosstool-ng/ct-ng-final/.build/src/gmp-5.1.1/mpn/generic/sb_div_sec.c to mpn/sb_div_qr_sec.c
1184[CFG  ]    config.status: linking /home/ubuntu/build/crosstool-ng/ct-ng-final/.build/src/gmp-5.1.1/mpn/generic/sb_div_sec.c to mpn/sb_div_r_sec.c
1185[CFG  ]    config.status: linking /home/ubuntu/build/crosstool-ng/ct-ng-final/.build/src/gmp-5.1.1/mpn/generic/sbpi1_div_sec.c to mpn/sbpi1_div_qr_sec.c
1186[CFG  ]    config.status: linking /home/ubuntu/build/crosstool-ng/ct-ng-final/.build/src/gmp-5.1.1/mpn/generic/sbpi1_div_sec.c to mpn/sbpi1_div_r_sec.c
1187[CFG  ]    config.status: linking /home/ubuntu/build/crosstool-ng/ct-ng-final/.build/src/gmp-5.1.1/mpn/generic/trialdiv.c to mpn/trialdiv.c
1188[CFG  ]    config.status: linking /home/ubuntu/build/crosstool-ng/ct-ng-final/.build/src/gmp-5.1.1/mpn/generic/remove.c to mpn/remove.c
1189[CFG  ]    config.status: linking /home/ubuntu/build/crosstool-ng/ct-ng-final/.build/src/gmp-5.1.1/mpn/generic/logops_n.c to mpn/and_n.c
1190[CFG  ]    config.status: linking /home/ubuntu/build/crosstool-ng/ct-ng-final/.build/src/gmp-5.1.1/mpn/generic/logops_n.c to mpn/andn_n.c
1191[CFG  ]    config.status: linking /home/ubuntu/build/crosstool-ng/ct-ng-final/.build/src/gmp-5.1.1/mpn/generic/logops_n.c to mpn/nand_n.c
1192[CFG  ]    config.status: linking /home/ubuntu/build/crosstool-ng/ct-ng-final/.build/src/gmp-5.1.1/mpn/generic/logops_n.c to mpn/ior_n.c
1193[CFG  ]    config.status: linking /home/ubuntu/build/crosstool-ng/ct-ng-final/.build/src/gmp-5.1.1/mpn/generic/logops_n.c to mpn/iorn_n.c
1194[CFG  ]    config.status: linking /home/ubuntu/build/crosstool-ng/ct-ng-final/.build/src/gmp-5.1.1/mpn/generic/logops_n.c to mpn/nior_n.c
1195[CFG  ]    config.status: linking /home/ubuntu/build/crosstool-ng/ct-ng-final/.build/src/gmp-5.1.1/mpn/generic/logops_n.c to mpn/xor_n.c
1196[CFG  ]    config.status: linking /home/ubuntu/build/crosstool-ng/ct-ng-final/.build/src/gmp-5.1.1/mpn/generic/logops_n.c to mpn/xnor_n.c
1197[CFG  ]    config.status: linking /home/ubuntu/build/crosstool-ng/ct-ng-final/.build/src/gmp-5.1.1/mpn/x86/copyi.asm to mpn/copyi.asm
1198[CFG  ]    config.status: linking /home/ubuntu/build/crosstool-ng/ct-ng-final/.build/src/gmp-5.1.1/mpn/x86/p6/copyd.asm to mpn/copyd.asm
1199[CFG  ]    config.status: linking /home/ubuntu/build/crosstool-ng/ct-ng-final/.build/src/gmp-5.1.1/mpn/generic/zero.c to mpn/zero.c
1200[CFG  ]    config.status: linking /home/ubuntu/build/crosstool-ng/ct-ng-final/.build/src/gmp-5.1.1/mpn/x86/tabselect.asm to mpn/tabselect.asm
1201[CFG  ]    config.status: linking /home/ubuntu/build/crosstool-ng/ct-ng-final/.build/src/gmp-5.1.1/mpn/generic/comb_tables.c to mpn/comb_tables.c
1202[CFG  ]    config.status: linking /home/ubuntu/build/crosstool-ng/ct-ng-final/.build/src/gmp-5.1.1/mpn/x86/umul.asm to mpn/umul.asm
1203[CFG  ]    config.status: linking /home/ubuntu/build/crosstool-ng/ct-ng-final/.build/src/gmp-5.1.1/mpn/x86/udiv.asm to mpn/udiv.asm
1204[CFG  ]    config.status: linking /home/ubuntu/build/crosstool-ng/ct-ng-final/.build/src/gmp-5.1.1/mpn/generic/add_n_sub_n.c to mpn/add_n_sub_n.c
1205[CFG  ]    config.status: linking /home/ubuntu/build/crosstool-ng/ct-ng-final/.build/src/gmp-5.1.1/mpn/x86/p6/gmp-mparam.h to gmp-mparam.h
1206[CFG  ]    config.status: executing libtool commands
1207[CFG  ]    configure: WARNING: unrecognized options: --enable-mpbsd
1208[CFG  ]    configure: summary of build options:
1209[CFG  ]   
1210[CFG  ]      Version:           GNU MP 5.1.1
1211[CFG  ]      Host type:         i686-build_pc-linux-gnu
1212[CFG  ]      ABI:               32
1213[CFG  ]      Install prefix:    /home/ubuntu/build/crosstool-ng/ct-ng-final/.build/i686-apple-darwin10/buildtools
1214[CFG  ]      Compiler:          i686-build_pc-linux-gnu-gcc -std=gnu99
1215[CFG  ]      Static libraries:  yes
1216[CFG  ]      Shared libraries:  no
1217[CFG  ]   
1218[EXTRA]    Building GMP
1219[DEBUG]    ==> Executing: 'make' '-j5' '-l'
1220[ALL  ]    make[1]: Entering directory `/home/ubuntu/build/crosstool-ng/ct-ng-final/.build/i686-apple-darwin10/build/build-gmp-host-i686-build_pc-linux-gnu'
1221[ALL  ]    /bin/bash ./config.status --recheck
1222[ALL  ]    running CONFIG_SHELL=/bin/bash /bin/bash /home/ubuntu/build/crosstool-ng/ct-ng-final/.build/src/gmp-5.1.1/configure --build=i686-build_pc-linux-gnu --host=i686-build_pc-linux-gnu --prefix=/home/ubuntu/build/crosstool-ng/ct-ng-final/.build/i686-apple-darwin10/buildtools --enable-fft --enable-mpbsd --enable-cxx --disable-shared --enable-static ABI=32 build_alias=i686-build_pc-linux-gnu host_alias=i686-build_pc-linux-gnu CC=i686-build_pc-linux-gnu-gcc CFLAGS=-O2 -g -pipe -m32 -fexceptions LDFLAGS= -m32 CXX=i686-build_pc-linux-gnu-g++ --no-create --no-recursion
1223[ALL  ]    configure: WARNING: unrecognized options: --enable-mpbsd
1224[ALL  ]    checking build system type... i686-build_pc-linux-gnu
1225[ALL  ]    checking host system type... i686-build_pc-linux-gnu
1226[ALL  ]    checking for a BSD-compatible install... /home/ubuntu/build/crosstool-ng/ct-ng-final/.build/tools/bin/install -c
1227[ERROR]    checking whether build environment is sane... configure: error: newly created file is older than distributed files!
1228[ALL  ]    Check your system clock
1229[ERROR]    make[1]: *** [config.status] Error 1
1230[ALL  ]    make[1]: Leaving directory `/home/ubuntu/build/crosstool-ng/ct-ng-final/.build/i686-apple-darwin10/build/build-gmp-host-i686-build_pc-linux-gnu'
1231[ERROR] 
1232[ERROR]  >>
1233[ERROR]  >>  Build failed in step 'Installing GMP for host'
1234[ERROR]  >>        called in step '(top-level)'
1235[ERROR]  >>
1236[ERROR]  >>  Error happened in: CT_DoExecLog[scripts/functions@257]
1237[ERROR]  >>        called from: do_gmp_backend[scripts/build/companion_libs/100-gmp.sh@105]
1238[ERROR]  >>        called from: do_gmp_for_host[scripts/build/companion_libs/100-gmp.sh@60]
1239[ERROR]  >>        called from: do_companion_libs_for_host[scripts/build/companion_libs.sh@36]
1240[ERROR]  >>        called from: main[scripts/crosstool-NG.sh@651]
1241[ERROR]  >>
1242[ERROR]  >>  For more info on this error, look at the file: 'build.log'
1243[ERROR]  >>  There is a list of known issues, some with workarounds, in:
1244[ERROR]  >>      '/usr/local/share/doc/crosstool-ng/ct-ng.hg+unknown-20000101.000000/B - Known issues.txt'
1245[ERROR] 
1246[ERROR]  (elapsed: 0:00.09)