Ticket #9711: cross_mac_vm

File cross_mac_vm, 10.1 KB (added by gk, 6 years ago)
Line 
1[INFO ]  Installing cctools for host
2[DEBUG]    Entering '/home/firefox/crosstool-ng/ct-ng-final/.build/i686-apple-darwin10/build/build-cctools-host-i686-build_pc-linux-gnu'
3[EXTRA]    Configuring cctools
4[DEBUG]    ==> Executing: 'CFLAGS=-O2 -g -pipe -m32 -I/home/firefox/crosstool-ng/ct-ng-final/.build/i686-apple-darwin10/buildtools/include/' 'CXXFLAGS=-O2 -g -pipe -m32 -I/home/firefox/crosstool-ng/ct-ng-final/.build/i686-apple-darwin10/buildtools/include/' 'LDFLAGS= -m32 -L/home/firefox/crosstool-ng/ct-ng-final/.build/i686-apple-darwin10/buildtools/lib/' '/home/firefox/crosstool-ng/ct-ng-final/.build/src/cctools-809/configure' '--build=i686-build_pc-linux-gnu' '--host=i686-build_pc-linux-gnu' '--target=i686-apple-darwin10' '--prefix=/home/firefox/x-tools/i686-apple-darwin10' '--with-llvm=/home/firefox/x-tools/i686-apple-darwin10' '--disable-static' '--enable-shared' '--with-sysroot=/home/firefox/x-tools/i686-apple-darwin10/i686-apple-darwin10/sysroot'
5[CFG  ]    checking for i686-build_pc-linux-gnu-gcc... i686-build_pc-linux-gnu-gcc
6[CFG  ]    checking whether the C compiler works... yes
7[CFG  ]    checking for C compiler default output file name... a.out
8[CFG  ]    checking for suffix of executables...
9[CFG  ]    checking whether we are cross compiling... no
10[CFG  ]    checking for suffix of object files... o
11[CFG  ]    checking whether we are using the GNU C compiler... yes
12[CFG  ]    checking whether i686-build_pc-linux-gnu-gcc accepts -g... yes
13[CFG  ]    checking for i686-build_pc-linux-gnu-gcc option to accept ISO C89... none needed
14[CFG  ]    checking how to run the C preprocessor... i686-build_pc-linux-gnu-gcc -E
15[CFG  ]    checking for grep that handles long lines and -e... /home/firefox/crosstool-ng/ct-ng-final/.build/tools/bin/grep
16[CFG  ]    checking for egrep... /home/firefox/crosstool-ng/ct-ng-final/.build/tools/bin/grep -E
17[CFG  ]    checking for ANSI C header files... yes
18[CFG  ]    checking for sys/types.h... yes
19[CFG  ]    checking for sys/stat.h... yes
20[CFG  ]    checking for stdlib.h... yes
21[CFG  ]    checking for string.h... yes
22[CFG  ]    checking for memory.h... yes
23[CFG  ]    checking for strings.h... yes
24[CFG  ]    checking for inttypes.h... yes
25[CFG  ]    checking for stdint.h... yes
26[CFG  ]    checking for unistd.h... yes
27[CFG  ]    checking minix/config.h usability... no
28[CFG  ]    checking minix/config.h presence... no
29[CFG  ]    checking for minix/config.h... no
30[CFG  ]    checking whether it is safe to define __EXTENSIONS__... yes
31[CFG  ]    checking for a BSD-compatible install... /home/firefox/crosstool-ng/ct-ng-final/.build/tools/bin/install -c
32[CFG  ]    checking whether ln -s works... yes
33[CFG  ]    checking for i686-build_pc-linux-gnu-gcc... (cached) i686-build_pc-linux-gnu-gcc
34[CFG  ]    checking whether we are using the GNU C compiler... (cached) yes
35[CFG  ]    checking whether i686-build_pc-linux-gnu-gcc accepts -g... (cached) yes
36[CFG  ]    checking for i686-build_pc-linux-gnu-gcc option to accept ISO C89... (cached) none needed
37[CFG  ]    checking for i686-build_pc-linux-gnu-g++... i686-build_pc-linux-gnu-g++
38[CFG  ]    checking whether we are using the GNU C++ compiler... yes
39[CFG  ]    checking whether i686-build_pc-linux-gnu-g++ accepts -g... yes
40[CFG  ]    checking for i686-build_pc-linux-gnu-gcc option to accept ISO C99... -std=gnu99
41[CFG  ]    checking build system type... i686-build_pc-linux-gnu
42[CFG  ]    checking host system type... i686-build_pc-linux-gnu
43[CFG  ]    checking target system type... i686-apple-darwin10
44[CFG  ]    checking whether C compiler accepts ... yes
45[CFG  ]    checking whether C compiler accepts -D__DARWIN_UNIX03... yes
46[CFG  ]    checking whether C compiler accepts -D__STDC_LIMIT_MACROS... yes
47[CFG  ]    checking whether C compiler accepts -D__STDC_CONSTANT_MACROS... yes
48[CFG  ]    checking whether C compiler accepts -D__DARWIN_UNIX03... (cached) yes
49[CFG  ]    checking whether C compiler accepts -D__STDC_LIMIT_MACROS... (cached) yes
50[CFG  ]    checking whether C compiler accepts -D__STDC_CONSTANT_MACROS... (cached) yes
51[CFG  ]    checking libc.h usability... no
52[CFG  ]    checking libc.h presence... no
53[CFG  ]    checking for libc.h... no
54[CFG  ]    checking dlfcn.h usability... yes
55[CFG  ]    checking dlfcn.h presence... yes
56[CFG  ]    checking for dlfcn.h... yes
57[CFG  ]    checking err.h usability... yes
58[CFG  ]    checking err.h presence... yes
59[CFG  ]    checking for err.h... yes
60[CFG  ]    checking execinfo.h usability... yes
61[CFG  ]    checking execinfo.h presence... yes
62[CFG  ]    checking for execinfo.h... yes
63[CFG  ]    checking sys/cdefs.h usability... yes
64[CFG  ]    checking sys/cdefs.h presence... yes
65[CFG  ]    checking for sys/cdefs.h... yes
66[CFG  ]    checking sys/_endian.h usability... no
67[CFG  ]    checking sys/_endian.h presence... no
68[CFG  ]    checking for sys/_endian.h... no
69[CFG  ]    checking sys/mman.h usability... yes
70[CFG  ]    checking sys/mman.h presence... yes
71[CFG  ]    checking for sys/mman.h... yes
72[CFG  ]    checking sys/sysctl.h usability... yes
73[CFG  ]    checking sys/sysctl.h presence... yes
74[CFG  ]    checking for sys/sysctl.h... yes
75[CFG  ]    checking paths.h usability... yes
76[CFG  ]    checking paths.h presence... yes
77[CFG  ]    checking for paths.h... yes
78[CFG  ]    checking servers/bootstrap.h usability... no
79[CFG  ]    checking servers/bootstrap.h presence... no
80[CFG  ]    checking for servers/bootstrap.h... no
81[CFG  ]    checking malloc/malloc.h usability... no
82[CFG  ]    checking malloc/malloc.h presence... no
83[CFG  ]    checking for malloc/malloc.h... no
84[CFG  ]    checking configure.h usability... no
85[CFG  ]    checking configure.h presence... no
86[CFG  ]    checking for configure.h... no
87[CFG  ]    checking tzfile.h usability... no
88[CFG  ]    checking tzfile.h presence... no
89[CFG  ]    checking for tzfile.h... no
90[CFG  ]    checking CommonCrypto/CommonDigest.h usability... no
91[CFG  ]    checking CommonCrypto/CommonDigest.h presence... no
92[CFG  ]    checking for CommonCrypto/CommonDigest.h... no
93[CFG  ]    checking for uid_t in sys/types.h... yes
94[CFG  ]    checking for caddr_t... yes
95[CFG  ]    checking for sigset_t... yes
96[CFG  ]    checking for u_int32_t... yes
97[CFG  ]    checking for u_char... yes
98[CFG  ]    checking for u_short... yes
99[CFG  ]    checking for u_int... yes
100[CFG  ]    checking whether MIN is declared... yes
101[CFG  ]    checking whether sleep is declared... yes
102[CFG  ]    checking whether SIGHUP is declared... yes
103[CFG  ]    checking whether SIGPIPE is declared... yes
104[CFG  ]    checking for dl_info... no
105[CFG  ]    checking whether O_BINARY is declared... no
106[CFG  ]    checking for bcmp... yes
107[CFG  ]    checking for bcopy... yes
108[CFG  ]    checking for bzero... yes
109[CFG  ]    checking for setbuffer... yes
110[CFG  ]    checking for getwd... yes
111[CFG  ]    checking for ffs... yes
112[CFG  ]    checking for getc_unlocked... yes
113[CFG  ]    checking whether ULLONG_MAX is declared... yes
114[CFG  ]    checking for CTL_KERN in sys/sysctl.h... yes
115[CFG  ]    checking for KERN_OSRELEASE in sys/sysctl.h... yes
116[CFG  ]    checking whether __unused is declared... no
117[CFG  ]    checking whether FP_PREC_24B is declared... no
118[CFG  ]    checking whether FP_PREC_53B is declared... no
119[CFG  ]    checking whether FP_PREC_64B is declared... no
120[CFG  ]    checking whether FP_RND_NEAR is declared... no
121[CFG  ]    checking whether FP_RND_DOWN is declared... no
122[CFG  ]    checking whether FP_RND_UP is declared... no
123[CFG  ]    checking whether FP_CHOP is declared... no
124[CFG  ]    checking whether S_IFSOCK is declared... yes
125[CFG  ]    checking whether S_ISUID is declared... yes
126[CFG  ]    checking whether S_IFLNK is declared... yes
127[CFG  ]    checking whether S_IRGRP is declared... yes
128[CFG  ]    checking whether S_IWGRP is declared... yes
129[CFG  ]    checking whether S_IXGRP is declared... yes
130[CFG  ]    checking whether S_ISGID is declared... yes
131[CFG  ]    checking whether S_IROTH is declared... yes
132[CFG  ]    checking whether S_IWOTH is declared... yes
133[CFG  ]    checking whether S_IXOTH is declared... yes
134[CFG  ]    checking whether S_ISVTX is declared... yes
135[CFG  ]    checking whether EBADRPC is declared... no
136[CFG  ]    checking whether EFTYPE is declared... no
137[CFG  ]    checking whether CPU_SUBTYPE_ARM_V5TEJ is declared... no
138[CFG  ]    checking whether CPU_SUBTYPE_ARM_XSCALE is declared... no
139[CFG  ]    checking whether CPU_SUBTYPE_ARM_V7 is declared... no
140[CFG  ]    checking whether N_ARM_THUMB_DEF is declared... no
141[CFG  ]    checking for i686-build_pc-linux-gnu-ranlib... i686-build_pc-linux-gnu-ranlib
142[CFG  ]    checking for i686-build_pc-linux-gnu-ar... i686-build_pc-linux-gnu-ar
143[CFG  ]    checking for configured assembler targets... ppc ppc64 i386 x86_64 arm
144[CFG  ]    configure: "Using llvm in prefix /home/firefox/x-tools/i686-apple-darwin10"
145[CFG  ]    checking whether C compiler accepts -I/home/firefox/x-tools/i686-apple-darwin10/include... yes
146[CFG  ]    checking whether C compiler accepts -L/home/firefox/x-tools/i686-apple-darwin10/lib... yes
147[CFG  ]    configure: WARNING: llvm-config (/home/firefox/x-tools/i686-apple-darwin10/bin/i686-apple-darwin10-llvm-config) not found, will use LLVM 2.7 defaults
148[CFG  ]    checking whether C compiler accepts -mdynamic-no-pic... no
149[CFG  ]    checking whether C compiler accepts -fno-builtin-round... yes
150[CFG  ]    checking whether C compiler accepts -fno-builtin-trunc... yes
151[CFG  ]    checking if -no-cpp-precomp is supported... no
152[CFG  ]    checking whether C compiler accepts -Wimport... yes
153[CFG  ]    checking whether C compiler accepts -Wunused-variable... yes
154[CFG  ]    checking whether C compiler accepts -Wunused-but-set-variable... yes
155[CFG  ]    checking whether C compiler accepts -Wdeprecated-declarations... yes
156[CFG  ]    /home/firefox/crosstool-ng/ct-ng-final/.build/src/cctools-809/configure: 7113: ./configure.lineno: Bad substitution
157[ERROR] 
158[ERROR]  >>
159[ERROR]  >>  Build failed in step 'Installing cctools for host'
160[ERROR]  >>        called in step '(top-level)'
161[ERROR]  >>
162[ERROR]  >>  Error happened in: CT_DoExecLog[scripts/functions@257]
163[ERROR]  >>        called from: do_cctools_backend[scripts/build/binutils/cctools.sh@124]
164[ERROR]  >>        called from: do_binutils_for_host[scripts/build/binutils/cctools.sh@81]
165[ERROR]  >>        called from: main[scripts/crosstool-NG.sh@664]
166[ERROR]  >>