Custom Query (23268 matches)

Filters
 
Or
 
  
 
Columns

Show under each result:


Results (67 - 69 of 23268)

Ticket Resolution Summary Owner Reporter
#30697 duplicate test_get_hidden_service_descriptor fails with an unexpected response code atagar teor
Description
======================================================================
ERROR: test_get_hidden_service_descriptor
----------------------------------------------------------------------
Traceback (most recent call last):
  File "/home/travis/build/torproject/stem/test/require.py", line 57, in wrapped
    return func(self, *args, **kwargs)
  File "/home/travis/build/torproject/stem/test/require.py", line 57, in wrapped
    return func(self, *args, **kwargs)
  File "/home/travis/build/torproject/stem/test/require.py", line 57, in wrapped
    return func(self, *args, **kwargs)
  File "/home/travis/build/torproject/stem/test/integ/control/controller.py", line 1292, in test_get_hidden_service_descriptor
    desc = controller.get_hidden_service_descriptor('3g2upl4pq6kufc4m.onion')
  File "/home/travis/build/torproject/stem/stem/control.py", line 487, in wrapped
    return func(self, *args, **kwargs)
  File "/home/travis/build/torproject/stem/stem/control.py", line 2186, in get_hidden_service_descriptor
    raise stem.ProtocolError('HSFETCH returned unexpected response code: %s' % response.code)
ProtocolError: HSFETCH returned unexpected response code: 512
----------------------------------------------------------------------

https://travis-ci.org/torproject/stem/jobs/539138294#L1832

I think this might have been a recent tor change?

#30696 fixed stem's test_close_stream fails with an extra stream in --target ONLINE mode atagar teor
Description
======================================================================
FAIL: test_close_stream
----------------------------------------------------------------------
Traceback (most recent call last):
  File "/Users/travis/build/torproject/stem/test/require.py", line 57, in wrapped
    return func(self, *args, **kwargs)
  File "/Users/travis/build/torproject/stem/test/require.py", line 57, in wrapped
    return func(self, *args, **kwargs)
  File "/Users/travis/build/torproject/stem/test/integ/control/controller.py", line 1072, in test_close_stream
    self.assertEqual([built_stream.id], [stream.id for stream in controller.get_streams()])
AssertionError: Lists differ: ['109'] != ['109', '441']
Second list contains 1 additional elements.
First extra element 1:
'441'
- ['109']
+ ['109', '441']
----------------------------------------------------------------------
Ran 48 tests in 42.095s
FAILED (failures=1, skipped=6)

https://travis-ci.org/torproject/stem/jobs/539138288#L536

#30694 fixed Restrict the tor CI stem job to tests that actually use tor teor
Description

From https://trac.torproject.org/projects/tor/ticket/30653?replyto=2#comment:2

  1. Tests tor/stem interoperability. This is the only thing the network team has cause to care about. For this I'd suggest running python 3.x with...

run_tests.py --integ --test control.controller --test control.base_controller --test process

Note: See TracQuery for help on using queries.