Opened 10 years ago

Last modified 7 years ago

#1119 closed defect (Fixed)

Tor 0.2.2.4-alpha build failure

Reported by: phobos Owned by:
Priority: Low Milestone:
Component: Core Tor/Tor Version: 0.2.2.3-alpha
Severity: Keywords:
Cc: phobos Actual Points:
Parent ID: Points:
Reviewer: Sponsor:

Description

gcc -DHAVE_CONFIG_H -I. -I../.. -DSHARE_DATADIR="\"/Library/Tor/share\"" -DLOCALSTATEDIR="\"/Library/Tor/var\"" -DBINDIR="\"/Library/Tor\"" -I../../src/common -I../or -g -O2 -Wall -g -O2 -fno-strict-aliasing -MT test.o -MD -MP -MF .deps/test.Tpo -c -o test.o test.c
test.c:46:18: test.h: No such file or directory
test.c: In function `test_buffers':
test.c:181: warning: implicit declaration of function `test_fail'
test.c:184: warning: implicit declaration of function `test_eq'
test.c:196: warning: implicit declaration of function `test_memeq'
test.c:400: warning: label `done' defined but not used
test.c: In function `test_onion_handshake':
test.c:427: warning: implicit declaration of function `test_assert'
test.c:445: warning: implicit declaration of function `test_memneq'
test.c:447: warning: label `done' defined but not used
test.c: In function `test_circuit_timeout':
test.c:612: warning: label `done' defined but not used
test.c: In function `test_policy_summary_helper':
test.c:637: warning: implicit declaration of function `test_streq'
test.c:639: warning: label `done' defined but not used
test.c: In function `test_policies':
test.c:792: warning: label `done' defined but not used
test.c: In function `test_rend_fns':
test.c:998: warning: label `done' defined but not used
test.c: In function `test_geoip':
test.c:1071: warning: label `done' defined but not used
test.c: In function `legacy_test_setup':
test.c:1078: error: dereferencing pointer to incomplete type
test.c: At top level:
test.c:1096: error: variable `legacy_setup' has initializer but incomplete type
test.c:1097: warning: excess elements in struct initializer
test.c:1097: warning: (near initialization for `legacy_setup')
test.c:1098: warning: excess elements in struct initializer
test.c:1098: warning: (near initialization for `legacy_setup')
test.c:1108: error: elements of array `test_array' have incomplete type
test.c:1109: warning: excess elements in struct initializer
test.c:1109: warning: (near initialization for `test_array[0]')
test.c:1109: warning: excess elements in struct initializer
test.c:1109: warning: (near initialization for `test_array[0]')
test.c:1109: warning: excess elements in struct initializer
test.c:1109: warning: (near initialization for `test_array[0]')
test.c:1109: warning: excess elements in struct initializer
test.c:1109: warning: (near initialization for `test_array[0]')
test.c:1109: warning: excess elements in struct initializer
test.c:1109: warning: (near initialization for `test_array[0]')
test.c:1110: warning: excess elements in struct initializer
test.c:1110: warning: (near initialization for `test_array[1]')
test.c:1110: warning: excess elements in struct initializer
test.c:1110: warning: (near initialization for `test_array[1]')
test.c:1110: warning: excess elements in struct initializer
test.c:1110: warning: (near initialization for `test_array[1]')
test.c:1110: warning: excess elements in struct initializer
test.c:1110: warning: (near initialization for `test_array[1]')
test.c:1110: warning: excess elements in struct initializer
test.c:1110: warning: (near initialization for `test_array[1]')
test.c:1111: warning: excess elements in struct initializer
test.c:1111: warning: (near initialization for `test_array[2]')
test.c:1111: warning: excess elements in struct initializer
test.c:1111: warning: (near initialization for `test_array[2]')
test.c:1111: warning: excess elements in struct initializer
test.c:1111: warning: (near initialization for `test_array[2]')
test.c:1111: warning: excess elements in struct initializer
test.c:1111: warning: (near initialization for `test_array[2]')
test.c:1111: warning: excess elements in struct initializer
test.c:1111: warning: (near initialization for `test_array[2]')
test.c:1112: warning: excess elements in struct initializer
test.c:1112: warning: (near initialization for `test_array[3]')
test.c:1112: warning: excess elements in struct initializer
test.c:1112: warning: (near initialization for `test_array[3]')
test.c:1112: warning: excess elements in struct initializer
test.c:1112: warning: (near initialization for `test_array[3]')
test.c:1112: warning: excess elements in struct initializer
test.c:1112: warning: (near initialization for `test_array[3]')
test.c:1112: warning: excess elements in struct initializer
test.c:1112: warning: (near initialization for `test_array[3]')
test.c:1113: warning: excess elements in struct initializer
test.c:1113: warning: (near initialization for `test_array[4]')
test.c:1113: warning: excess elements in struct initializer
test.c:1113: warning: (near initialization for `test_array[4]')
test.c:1113: warning: excess elements in struct initializer
test.c:1113: warning: (near initialization for `test_array[4]')
test.c:1113: warning: excess elements in struct initializer
test.c:1113: warning: (near initialization for `test_array[4]')
test.c:1113: warning: excess elements in struct initializer
test.c:1113: warning: (near initialization for `test_array[4]')
test.c:1114: warning: excess elements in struct initializer
test.c:1114: warning: (near initialization for `test_array[5]')
test.c:1114: warning: excess elements in struct initializer
test.c:1114: warning: (near initialization for `test_array[5]')
test.c:1114: warning: excess elements in struct initializer
test.c:1114: warning: (near initialization for `test_array[5]')
test.c:1114: warning: excess elements in struct initializer
test.c:1114: warning: (near initialization for `test_array[5]')
test.c:1114: warning: excess elements in struct initializer
test.c:1114: warning: (near initialization for `test_array[5]')
test.c:1116: warning: excess elements in struct initializer
test.c:1116: warning: (near initialization for `test_array[6]')
test.c:1116: warning: excess elements in struct initializer
test.c:1116: warning: (near initialization for `test_array[6]')
test.c:1116: error: `TT_SKIP' undeclared here (not in a function)
test.c:1116: warning: excess elements in struct initializer
test.c:1116: warning: (near initialization for `test_array[6]')
test.c:1116: warning: excess elements in struct initializer
test.c:1116: warning: (near initialization for `test_array[6]')
test.c:1116: warning: excess elements in struct initializer
test.c:1116: warning: (near initialization for `test_array[6]')
test.c:1117: warning: excess elements in struct initializer
test.c:1117: warning: (near initialization for `test_array[7]')
test.c:1117: warning: excess elements in struct initializer
test.c:1117: warning: (near initialization for `test_array[7]')
test.c:1117: error: `TT_SKIP' undeclared here (not in a function)
test.c:1117: warning: excess elements in struct initializer
test.c:1117: warning: (near initialization for `test_array[7]')
test.c:1117: warning: excess elements in struct initializer
test.c:1117: warning: (near initialization for `test_array[7]')
test.c:1117: warning: excess elements in struct initializer
test.c:1117: warning: (near initialization for `test_array[7]')
test.c:1119: error: `END_OF_TESTCASES' undeclared here (not in a function)
test.c:1119: error: initializer element is not constant
test.c:1119: error: (near initialization for `test_array[8]')
test.c:1127: error: elements of array `testgroups' have incomplete type
test.c:1128: warning: excess elements in struct initializer
test.c:1128: warning: (near initialization for `testgroups[0]')
test.c:1128: warning: excess elements in struct initializer
test.c:1128: warning: (near initialization for `testgroups[0]')
test.c:1129: warning: excess elements in struct initializer
test.c:1129: warning: (near initialization for `testgroups[1]')
test.c:1129: warning: excess elements in struct initializer
test.c:1129: warning: (near initialization for `testgroups[1]')
test.c:1130: warning: excess elements in struct initializer
test.c:1130: warning: (near initialization for `testgroups[2]')
test.c:1130: warning: excess elements in struct initializer
test.c:1130: warning: (near initialization for `testgroups[2]')
test.c:1131: warning: excess elements in struct initializer
test.c:1131: warning: (near initialization for `testgroups[3]')
test.c:1131: warning: excess elements in struct initializer
test.c:1131: warning: (near initialization for `testgroups[3]')
test.c:1132: warning: excess elements in struct initializer
test.c:1132: warning: (near initialization for `testgroups[4]')
test.c:1132: warning: excess elements in struct initializer
test.c:1132: warning: (near initialization for `testgroups[4]')
test.c:1133: warning: excess elements in struct initializer
test.c:1133: warning: (near initialization for `testgroups[5]')
test.c:1133: warning: excess elements in struct initializer
test.c:1133: warning: (near initialization for `testgroups[5]')
test.c:1135: error: `END_OF_GROUPS' undeclared here (not in a function)
test.c:1135: error: initializer element is not constant
test.c:1135: error: (near initialization for `testgroups[6]')
test.c: In function `main':
test.c:1199: warning: implicit declaration of function `tinytest_main'
../or/or.h: At top level:
test.c:1096: error: storage size of `legacy_setup' isn't known
make[4]: * [test.o] Error 1
make[3]:
* [all-recursive] Error 1
make[2]: * [all-recursive] Error 1
make[1]:
* [all] Error 2
make: * [dist-osx] Error 2

[Automatically added by flyspray2trac: Operating System: OSX 10.3 Panther]

Child Tickets

Change History (3)

comment:1 Changed 10 years ago by arma

Fixed for 0.2.2.5-alpha

comment:2 Changed 10 years ago by arma

flyspray2trac: bug closed.

comment:3 Changed 7 years ago by nickm

Component: Tor ClientTor
Note: See TracTickets for help on using tickets.