Opened 3 months ago

Closed 3 months ago

#30696 closed defect (fixed)

stem's test_close_stream fails with an extra stream in --target ONLINE mode

Reported by: teor Owned by: atagar
Priority: Medium Milestone:
Component: Core Tor/Stem Version:
Severity: Normal Keywords: ci, travis
Cc: teor Actual Points:
Parent ID: #28170 Points:
Reviewer: Sponsor:

Description

======================================================================
FAIL: test_close_stream
----------------------------------------------------------------------
Traceback (most recent call last):
  File "/Users/travis/build/torproject/stem/test/require.py", line 57, in wrapped
    return func(self, *args, **kwargs)
  File "/Users/travis/build/torproject/stem/test/require.py", line 57, in wrapped
    return func(self, *args, **kwargs)
  File "/Users/travis/build/torproject/stem/test/integ/control/controller.py", line 1072, in test_close_stream
    self.assertEqual([built_stream.id], [stream.id for stream in controller.get_streams()])
AssertionError: Lists differ: ['109'] != ['109', '441']
Second list contains 1 additional elements.
First extra element 1:
'441'
- ['109']
+ ['109', '441']
----------------------------------------------------------------------
Ran 48 tests in 42.095s
FAILED (failures=1, skipped=6)

https://travis-ci.org/torproject/stem/jobs/539138288#L536

Child Tickets

Change History (2)

comment:1 Changed 3 months ago by atagar

comment:2 Changed 3 months ago by atagar

Resolution: fixed
Status: newclosed
Note: See TracTickets for help on using tickets.