Opened 3 weeks ago

Last modified 3 weeks ago

#31553 new defect

"make test-stem" fails with missing cached_tor_manual.cfg

Reported by: teor Owned by: atagar
Priority: Medium Milestone:
Component: Core Tor/Stem Version:
Severity: Normal Keywords:
Cc: Actual Points:
Parent ID: Points:
Reviewer: Sponsor:

Description

test_install                                                 [FAILURE]
test_sdist                                             0 ms  [SUCCESS]

======================================================================
FAIL: test_install
----------------------------------------------------------------------
Traceback (most recent call last):
  File "/Users/base/stem/stem/util/test_tools.py", line 152, in <lambda>
    self.method = lambda test: self.result(test)  # method that can be mixed into TestCases
  File "/Users/base/stem/stem/util/test_tools.py", line 225, in result
    test.fail(self._result.msg)
AssertionError: The following files were expected to be in our installation but weren't. Maybe our setup.py needs to be updated?

stem/cached_tor_manual.cfg

----------------------------------------------------------------------
Ran 2 tests in 0.000s

FAILED (failures=1)
======================================================================
                             INITIALISING                             
======================================================================

  stem version...                            1.7.1-dev (commit 6790035c)
  tor version...                             0.4.2.0-alpha-dev (commit 04ab357d)
  python version...                          3.7.4
  operating system...                        Darwin (17.7.0)
  cryptography version...                    2.7
  mock version...                            1.0
  pyflakes version...                        missing
  pycodestyle version...                     missing
  checking for orphaned .pyc files...        done (0.0s)
  checking for unused tests...               done (0.0s)
  importing test modules...                  done (0.1s)
  emptying our tor data directory...         skipped
  running pyflakes...                        unavailable
  running pycodestyle...                     unavailable

The long-term fix is lowering #30694 from travis to "make test-stem". I'll open a ticket.

Child Tickets

Change History (1)

comment:1 Changed 3 weeks ago by teor

The long-term fix is lowering #30694 from travis to "make test-stem". I'll open a ticket.

The ticket is #31554

Note: See TracTickets for help on using tickets.